Αρχαιολογικό αντικείμενο
pref label in plural: Archaeological objects @en
pref label in plural: Αρχαιολογικά αντικείμενα
broader: Τρισδιάστατα Αντικείμενα και Έργα Τέχνης
preferred label: Archaeological object @en
type: Concept

Μοντέλο
pref label in plural: Models @en
pref label in plural: Μοντέλα
narrower: Μακέτα
narrower: Πρόπλασμα
broader: Τρισδιάστατα Αντικείμενα και Έργα Τέχνης
preferred label: Model @en
type: Concept

Λόγος, Διαλέξη
pref label in plural: Λόγοι, διαλέξεις
pref label in plural: Speeches, lectures @en
distinct pref label: Λόγος, Διαλέξη (μαγνητοσκόπηση)
distinct pref label: Speech, Lecture (videorecording) @en
broader: Βίντεο
preferred label: Speech, Lecture @en
type: Concept

Ηχογράφηση παράστασης
pref label in plural: Ηχογραφήσεις παραστάσεων
pref label in plural: Performance recordings @en
narrower: Ηχογράφηση συναυλίας
narrower: Ηχογράφηση θεατρικής παράστασης
broader: Ηχογράφηση
preferred label: Performance recording @en
type: Concept

Κάρτα
type: Concept
pref label in plural: Κάρτες
narrower: Ευχετήρια κάρτα
narrower: Τράπουλα
preferred label: Card @en
narrower: Τηλεκάρτα
pref label in plural: Cards @en
narrower: Ταχυδρομική κάρτα
definition: Ορθογώνια κομμάτια από άκαμπτο χαρτί ή πλαστικό, συνήθως τυποποιημένων διαστάσεων, που χρησιμοποιούνται ως βάση πάνω στην οποία πληκτρολογούνται, γράφονται ή μεταγράφονται πληροφορίες.
broader: Εκτύπωση
definition: Rectangular pieces of stiff paper or plastic, usually of standard dimensions, used as a support on which information is typed, written, or transcribed. @en
narrower: Αφιερωματική κάρτα Αγίων

Βιντεοσκόπηση παράστασης
pref label in plural: Performance videorecordings @en
pref label in plural: Βιντεοσκoπήσεις παραστάσεων
narrower: Βιντεοσκόπηση συναυλίας
narrower: Βιντεοσκόπηση θεατρικής παράστασης
broader: Βίντεο
preferred label: Performance videorecording @en
type: Concept

Χάρτης
pref label in plural: Χάρτες
pref label in plural: Maps @en
broader: Χαρτογραφικό Υλικό
preferred label: Map @en
type: Concept

Ταφικό αντικείμενο
pref label in plural: Funerary objects @en
pref label in plural: Ταφικά αντικείμενα
broader: Τρισδιάστατα Αντικείμενα και Έργα Τέχνης
preferred label: Funerary object @en
type: Concept

Αντίγραφο
definition: Ακριβείς αναπαραγωγές αντικειμένων μεγάλης αξίας, που συνήθως έχουν τις ίδιες διαστάσεις με το πρωτότυπο. Ο όρος χρησιμοποιείται επίσης όταν γίνεται λόγος για την παραγωγή περισσότερων από ένα παρόμοιων αντικειμένων από τον ίδιο καλλιτέχνη, τεχνίτη ή στούντιο, που φέρουν ελάχιστες ή και καθόλου παραλλαγές μεταξύ τους. Εάν η παραλλαγή είναι εμφανής, τότε χρησιμοποιείται ο όρος ""εκδοχές"". Τα αντίγραφα διακρίνονται από τα ""πλαστά"", τα οποία παράγονται με την πρόθεση να εξαπατήσουν.
distinct pref label: Αντίγραφο (δισδιάστατο)
distinct pref label: Replica (2D) @en
type: Concept
preferred label: Replica @en
pref label in plural: Αντίγραφα
definition: Precise reproductions of valued objects, usually in the same dimensions as the original. Use also when more than one similar object is produced by the same artist, craftsman, or studio, with little or no variation between them; if variation is apparent, use ""versions."" Distinct from ""forgeries"" and ""counterfeits,"" which are produced with the intent to deceive. @en
pref label in plural: Replicas @en
broader: Δισδιάστατα γραφικά

Μάσκα
pref label in plural: Masks @en
pref label in plural: Μάσκες
broader: Τρισδιάστατα Αντικείμενα και Έργα Τέχνης
preferred label: Mask @en
type: Concept

Ανακοίνωση
broader: Κείμενο
pref label in plural: Ανακοινώσεις
narrower: Δελτίο τύπου
preferred label: Announcement @en
pref label in plural: Announcements @en
definition: Έντυπες, προφορικές ή δημοσιευμένες δηλώσεις που ενημερώνουν τον αναγνώστη για μια εκδήλωση ή άλλα νέα.
definition: "Printed, spoken, or published statements or notices that inform the reader of an event or other news. " @en
type: Concept

Παρτιτούρα
pref label in plural: Music scores @en
pref label in plural: Παρτιτούρες
broader: Παρτιτούρες
preferred label: Score @en
type: Concept

Φύλλο εφημερίδας
pref label in plural: Newspaper issues @en
pref label in plural: Φύλλα εφημερίδας
broader: Περιοδική έκδοση
alternative label: Εφημερίδα
alternative label: Τεύχος εφημερίδας
preferred label: Newspaper issue @en
type: Concept

Πρωτότυπο
pref label in plural: Πρωτότυπα
pref label in plural: Masters @en
distinct pref label: Master (3D) @en
distinct pref label: Πρωτότυπο (τρισδιάστατο)
broader: Τρισδιάστατα Αντικείμενα και Έργα Τέχνης
preferred label: Master @en
type: Concept

Μεταφορικό μέσο
pref label in plural: Μεταφορικά μέσα
pref label in plural: Means of transport @en
broader: Τρισδιάστατα Αντικείμενα και Έργα Τέχνης
preferred label: Means of transport @en
type: Concept

Φάκελος εγγράφων
pref label in plural: Document files
pref label in plural: Φάκελοι εγγράφων
broader: Κείμενο
preferred label: Document file @en
type: Concept

Κείμενο
narrower: Ανακοίνωση
narrower: Άρθρο
narrower: Μελέτη
narrower: Χειρόγραφο
narrower: Απόκομμα
narrower: Ευρετήριο
narrower: Βιβλίο
narrower: Φυλλάδιο
narrower: Θρησκευτικό κείμενο
type: Concept
narrower: Εγχειρίδιο
pref label in plural: Texts @en
narrower: Συνέντευξη
narrower: Διατριβή
narrower: Τμήμα έκδοσης
narrower: Λογοτεχνικό έργο
narrower: Τεκμήριο συνεδρίου
narrower: Λαογραφικό δελτίο
narrower: Διαφημιστικό
narrower: Κατάλογος
narrower: Πίνακας
pref label in plural: Κείμενα
narrower: Ημερολόγιο/Σημειωματάριο
narrower: Φάκελος εγγράφων
narrower: Λόγος, Διαλέξη
preferred label: Text @en
narrower: Τεκμήριο εκδήλωσης
narrower: Σημείωμα
narrower: Έγγραφο
narrower: Περιοδική έκδοση
definition: Γραπτές ή τυπωμένες λέξεις, φράσεις ή προτάσεις που χρησιμοποιούνται για την επικοινωνία. Σε αυτές περιλαμβάνονται οι προφορικές ανακοινώσεις που συντάσσονται γραπτώς ή εκτυπώνονται.
narrower: Οπτική προβολή/Παρουσίαση
definition: Written or printed words, phrases, or sentences arranged to make a communication. Includes oral verbal communications set down in writing or print. @en

Σήμα (σύμβολο)
distinct pref label: Σήμα (σύμβολο) (3D)
narrower: Σφράγισμα
preferred label: Identifying marking @en
broader: Τρισδιάστατα Αντικείμενα και Έργα Τέχνης
type: Concept
pref label in plural: Σύμβολα
narrower: Εραλδικό μνημείο
pref label in plural: Identifying markings @en
distinct pref label: Identifying marking (3D) @en

Ηχογράφηση
definition: Εγγραφή ήχου σε δίσκους, ταινίες ή άλλα μέσα
narrower: Λόγος, Διαλέξη
pref label in plural: Sound recordings @en
narrower: Εκδήλωση
pref label in plural: Ηχογραφήσεις
definition: Sound recorded on discs, tapes, filaments, or other media @en
narrower: Συνέντευξη
narrower: Απαγγελία
narrower: Ηχογράφηση παράστασης
narrower: Μουσικό κομμάτι
preferred label: Sound recording @en
type: Concept
narrower: Προφορική ιστορία
narrower: Τεκμήριο συνεδρίου

Ευρετήριο
pref label in plural: Indexes @en
type: Concept
definition: Systematic guides to the contents of texts, files, documents, or collections, presented as a list, usually in alphabetical order, of persons and/or subjects referred to in documents, with location of references thereto. @en
narrower: Καρτέλα ευρετηρίου
definition: Αλφαβητική λίστα όρων (π.χ. ονομάτων ή θεμάτων) με πληροφορίες σχετικά με τον εντοπισμό τους.
pref label in plural: Ευρετήρια
broader: Κείμενο
preferred label: Index @en

Δισδιάστατα γραφικά
narrower: Έργο τέχνης μεικτής τεχνικής
narrower: Σχέδιο
narrower: Εφήμερα
preferred label: 2D Graphics @en
narrower: Έργο χαρακτικής
narrower: Φωτογραφία
narrower: Έργο θρησκευτικής τέχνης
narrower: Κολάζ
type: Concept
narrower: Μακέτα
narrower: Έργο ζωγραφικής
narrower: Αντίγραφο
narrower: Ψηφιδωτό
narrower: Πρωτότυπο
narrower: Εικόνες και διακόσμηση έκδοσης
narrower: Εκτύπωση

Βιομηχανικό αντικείμενο
pref label in plural: Industrial items @en
pref label in plural: Βιομηχανικά αντικείμενα
broader: Εργαλεία και εξοπλισμός
preferred label: Industrial item @en
type: Concept

Επιγραφή
pref label in plural: Inscriptions @en
pref label in plural: Επιγραφές
broader: Τρισδιάστατα Αντικείμενα και Έργα Τέχνης
preferred label: Inscription @en
type: Concept

Επίπλωση
broader: Οικιακός εξοπλισμός
preferred label: Furniture @en
type: Concept

Έργο θρησκευτικής τέχνης
type: Concept
distinct pref label: Religious visual works (2D) @en
narrower: Φορητή Εικόνα
preferred label: Religious visual works @en
pref label in plural: Έργα θρησκευτικής τέχνης (δισδιάστατα)
definition: Visually-based works of art created or used within religious contexts. @en
broader: Δισδιάστατα γραφικά
distinct pref label: Έργο θρησκευτικής τέχνης (δισδιάστατο)
definition: Έργα τέχνης που δημιουργούνται ή χρησιμοποιούνται μέσα σε θρησκευτικά πλαίσια.
pref label in plural: Religious visual works (2D) @en

Μακέτα
distinct pref label: Μακέτα (2D)
distinct pref label: Scale model (2D) @en
broader: Δισδιάστατα γραφικά
preferred label: Scale model @en
type: Concept

Τμήμα περιοδικού
pref label in plural: Journal parts @en
pref label in plural: Τμήματα περιοδικού
narrower: Εξώφυλλο περιοδικού
broader: Τμήμα έκδοσης
preferred label: Journal part @en
type: Concept

Εκδήλωση
pref label in plural: Εκδηλώσεις
pref label in plural: Events @en
definition: Sound recording of occurrences taking place during a particular interval of time. @en
definition: Ηχογράφηση δημόσιας συνεργατικής πράξης ή δραστηριότητας για ποικίλους σκοπούς (εορταστικούς, επετειακούς, διαμαρτυρίας κ.ά.)
broader: Ηχογράφηση
preferred label: Event @en
type: Concept

Βίντεο
narrower: Τρέιλερ ταινίας/παράστασης
narrower: Μαγνητοσκόπηση
narrower: Λόγος, Διαλέξη
narrower: Συνέντευξη
preferred label: Video @en
type: Concept
narrower: Προφορική ιστορία
narrower: Βιντεοσκόπηση παράστασης
narrower: Animation ταινία
narrower: Διαφημιστικό σποτ
narrower: Τεκμήριο συνεδρίου
narrower: Ντοκιμαντέρ

Τρισδιάστατη αναπαράσταση
pref label in plural: Τρισδιάστατες αναπαραστάσεις
pref label in plural: 3D representations @en
narrower: Τρισδιάστατο μοντέλο από 3D σάρωση
narrower: Αρχείο εικονικής πραγματικότητας
preferred label: 3D representation @en
type: Concept

Σχέδιο
narrower: Τεχνικό σχέδιο
type: Concept
narrower: Διάγραμμα
definition: Visual works produced by drawing, which is the application of lines on a surface, often paper, by using a pencil, pen, chalk, or some other tracing instrument to focus on the delineation of form rather than the application of color. This term is often defined broadly to refer to computer-generated images as well. @en
narrower: Ζωγραφικό σχέδιο / Σκίτσο
pref label in plural: Drawings @en
preferred label: Drawing @en
broader: Δισδιάστατα γραφικά
pref label in plural: Σχέδια
definition: Τα οπτικά έργα που παράγονται με την τεχνική τουσχεδίου, που είναι η εφαρμογή γραμμών σε μια επιφάνεια, συχνά χαρτί, χρησιμοποιώντας ένα μολύβι, στυλό, κιμωλία ή κάποιο άλλο εργαλείο που εστιάζει στην οριοθέτηση της φόρμας και όχι στην εφαρμογή του χρώματος. Αυτός ο όρος συχνά αναφέρεται και σε εικόνες που παράγονται από υπολογιστή.

Εγχειρίδιο
pref label in plural: Manuals @en
pref label in plural: Εγχειρίδια
definition: Βιβλία ή διατριβές που περιέχουν κανόνες ή οδηγίες που απαιτούνται για την εκτέλεση καθηκόντων, λειτουργιών, διαδικασιών, επαγγελμάτων, τεχνών ή μελετών και προορίζονται να χρησιμοποιηθούν ως αναφορά ενώ εκτελείται το έργο ή η μελέτη
definition: Books or treatises, often compendious, containing rules or instructions needed to perform tasks, operations, processes, occupations, arts, or studies, and intended to be used as reference while the task or study is performed. @en
broader: Κείμενο
preferred label: Manual @en
type: Concept

Ανάγλυφο
pref label in plural: Reliefs @en
pref label in plural: Ανάγλυφα
narrower: Επιτύμβια πλάκα
broader: Τρισδιάστατα Αντικείμενα και Έργα Τέχνης
preferred label: Relief @en
type: Concept

Θρησκευτικό κείμενο
pref label in plural: Religious texts @en
pref label in plural: Θρησκευτικά κείμενα
definition: General term for texts of religion, sacred beliefs, or related to religious beliefs and practices. @en
definition: Γλωσσικό υλικό που περιέχει θρησκευτικά, λειτουργικά ή ιερά κείμενα ή/και μουσική (π.χ. ιστορίες από τη Βίβλο, κατηχήσεις, θρησκευτικά μυθιστορήματα, ύμνους, συγχωροχάρτια, λιτανείες, θρησκευτικά έργα, κηρύγματα, τα βιβλία των λειτουργιών, συνόψεις κλπ.).
broader: Κείμενο
preferred label: Religious text @en
type: Concept

Διαφημιστικό
pref label in plural: Διαφημιστικά
pref label in plural: Advertisements @en
definition: Public notices or paid announcements (especially those in print) that promote or sell a product, service or idea. @en
definition: Δημόσιες ή πληρωμένες ανακοινώσεις, (ειδικά εκείνες που έχουν εκτυπωθεί) που προωθούν ένα προϊόν, μια υπηρεσία ή ένα σκοπό.
broader: Κείμενο
preferred label: Advertisement @en
type: Concept

Ταχυδρομική κάρτα
definition: Cards on which a message may be written or printed for mailing without an envelope, usually at a lower rate than that for letters in envelopes. @en
broader: Κάρτα
definition: Κάρτα με γραφιστική απεικόνιση στη μία πλευρά που φέρει χειρόγραφο ή τυπωμένο μήνυμα και αποστέλλεται χωρίς φάκελο.
pref label in plural: Ταχυδρομικές κάρτες
type: Concept
alternative label: Καρτ Ποστάλ
pref label in plural: Postcards @en
preferred label: Postcard @en

Παιχνίδι
pref label in plural: Toys @en
pref label in plural: Παιχνίδια
narrower: Κούκλα
broader: Τρισδιάστατα Αντικείμενα και Έργα Τέχνης
alternative label: Οικοπαίγνιο
preferred label: Toy @en
type: Concept

Εργαλεία και εξοπλισμός
broader: Τρισδιάστατα Αντικείμενα και Έργα Τέχνης
narrower: Μουσικό όργανο
narrower: Οικιακός εξοπλισμός
type: Concept
narrower: Αθλητικός εξοπλισμός
narrower: Λειτουργικό αντικείμενο
preferred label: Tools and equipment @en
narrower: Σκηνικά αντικείμενα
narrower: Μηχάνημα
narrower: Βιομηχανικό αντικείμενο
narrower: Όπλο
narrower: Τηλεπικοινωνιακός εξοπλισμός

Συναυλία
pref label in plural: Concerts @en
pref label in plural: Συναυλίες
definition: Μουσική παράσταση, συνήθως δημόσια.
broader: Πολιτιστική παραγωγή
preferred label: Concert @en
type: Concept

Ενδυμασία
pref label in plural: Ενδυμασίες
pref label in plural: Costumes @en
broader: Τρισδιάστατα Αντικείμενα και Έργα Τέχνης
preferred label: Costume (mode of fashion) @en
type: Concept

Χαρτογραφικό Υλικό
narrower: Χάρτης
preferred label: Cartographic Material @en
type: Concept

Ηχογράφηση συναυλίας
pref label in plural: Ηχογραφήσεις συναυλιών
pref label in plural: Concert recordings @en
broader: Ηχογράφηση παράστασης
preferred label: Concert recording @en
type: Concept

Εξώφυλλο δίσκου
pref label in plural: Record covers @en
pref label in plural: Εξώφυλλα δίσκου
broader: Έντυπο υλικό
preferred label: Record cover @en
type: Concept

Πίνακας
pref label in plural: Tables @en
pref label in plural: Πίνακες
broader: Κείμενο
preferred label: Table @en
type: Concept

Φυλλάδιο
pref label in plural: Leaflets @en
pref label in plural: Φυλλάδια
distinct pref label: Φυλλάδιο
distinct pref label: Leaflet @en
broader: Έντυπο υλικό
preferred label: Leaflet @en
type: Concept

Φιγούρα θεάτρου σκιών
pref label in plural: Φιγούρες θεάτρου σκιών
pref label in plural: Shadow puppets @en
broader: Τρισδιάστατα Αντικείμενα και Έργα Τέχνης
preferred label: Shadow puppet @en
type: Concept

Οπτική προβολή/Παρουσίαση
pref label in plural: Οπτικές προβολές/Παρουσιάσεις
pref label in plural: Visual projections/Presentations @en
broader: Κείμενο
preferred label: Visual projection/Presentation @en
type: Concept

Απαγγελία
pref label in plural: Απαγγελίες
pref label in plural: Spoken word @en
broader: Ηχογράφηση
alternative label: Recitation @en
preferred label: Spoken word @en
type: Concept

Σφραγιδόλιθος
pref label in plural: Sealstones @en
pref label in plural: Σφραγιδόλιθοι
broader: Σφραγίδα
preferred label: Sealstone @en
type: Concept

Αρχιτεκτονικό μέλος
pref label in plural: Αρχιτεκτονικά μέλη
pref label in plural: Architectural elements @en
broader: Τρισδιάστατα Αντικείμενα και Έργα Τέχνης
preferred label: Architectural element @en
type: Concept

Τμήμα βιβλίου
pref label in plural: Τμήματα βιβλίου @en
pref label in plural: Book parts
narrower: Σελίδα βιβλίου
broader: Τμήμα έκδοσης
preferred label: Book part @en
type: Concept

Πινακίδα
pref label in plural: Tablets @en
pref label in plural: Πινακίδες
broader: Τρισδιάστατα Αντικείμενα και Έργα Τέχνης
alternative label: Writing board @en
preferred label: Tablet @en
type: Concept

Σκηνικά αντικείμενα
definition: Όλα τα κινητά αντικείμενα που χρησιμοποιούνται σε κινηματογραφική ταινία, τηλεόραση ή σετ σκηνικών που δεν είναι κοστούμι ή δομικά μέρος του σετ, όπως έπιπλα, διακοσμητικά αντικείμενα και αντικείμενα που κρατούνται από ηθοποιούς.
broader: Εργαλεία και εξοπλισμός
alternative label: ρεκουζίντα
alternative label: αντικείμενα σκηνής
alternative label: ρεκουζίτα
preferred label: Props @en
type: Concept

Αναμνηστικό αντικείμενο (σουβενίρ)
pref label in plural: Αναμνηστικά αντικείμενα (σουβενίρ)
pref label in plural: Souvenirs @en
broader: Τρισδιάστατα Αντικείμενα και Έργα Τέχνης
preferred label: Souvenir @en
type: Concept

Έργο τέχνης μεικτής τεχνικής
distinct pref label: Έργο τέχνης μεικτής τεχνικής (τρισδιάστατο)
preferred label: Mixed media work of art @en
broader: Τρισδιάστατα Αντικείμενα και Έργα Τέχνης
type: Concept
pref label in plural: Έργα τέχνης μεικτής τεχνικής
definition: Visual works created using multiple media. @en
distinct pref label: Mixed media work of art (3D) @en
definition: Έργα που δημιουργήθηκαν με χρήση πολλαπλών μέσων.
pref label in plural: Mixed media works of art (3D) @en

Τράπουλα
pref label in plural: Τράπουλες
definition: Cards made in sets of a designated number and marked for use as game accessories during play. The markings or designs may follow a standard suit or rank system or may be special and individualized. @en
definition: Τυπωμένες κάρτες που κατασκευάζονται σε σετ καθορισμένου αριθμού και χρησιμοποιούνται κατά τη διάρκεια του παιχνιδιού. Τα σύμβολα ή τα σχέδια μπορεί να ακολουθούν ένα πρότυπο ή σύστημα κατάταξης ή μπορεί να είναι ξεχωριστά και εξατομικευμένα.
broader: Κάρτα
preferred label: Playing cards @en
type: Concept

Πλακίδιο
pref label in plural: Tiles @en
pref label in plural: Πλακίδια
broader: Τρισδιάστατα Αντικείμενα και Έργα Τέχνης
preferred label: Tile @en
type: Concept

Φαγητό
broader: Τρισδιάστατα Αντικείμενα και Έργα Τέχνης
preferred label: Food @en
type: Concept

Δελτίο τύπου
pref label in plural: Δελτία τύπου
pref label in plural: Press releases @en
broader: Ανακοίνωση
preferred label: Press release @en
type: Concept

Πρόπλασμα
pref label in plural: Models @en
pref label in plural: Mockups @en
pref label in plural: Προπλάσματα
pref label in plural: Dummies @en
broader: Μοντέλο
alternative label: Mockup @en
preferred label: Model @en
type: Concept

Φυσικό δείγμα
pref label in plural: Φυσικά δείγματα
pref label in plural: Speciments @en
definition: Περιλαμβάνονται βιολογικά δείγματα, απολιθώματα κλπ. @en
broader: Τρισδιάστατα Αντικείμενα και Έργα Τέχνης
preferred label: Specimen @en
type: Concept

Μυθιστόρημα
pref label in plural: Fiction novels @en
pref label in plural: Μυθιστορήματα
definition: Genre that refers to works evoked from the imagination of the creator and not conferred as fact. @en
definition: Είδος που περιλαμβάνει λογοτεχνικά έργα που πηγάζουν από τη φαντασία του δημιουργού και δεν αναγνωρίζονται ως πραγματικά γεγονότα.
broader: Λογοτεχνικό έργο
preferred label: Fiction novel @en
type: Concept

Έργο χαρακτικής
pref label in plural: Engravings @en
pref label in plural: Έργα χαρακτικής
preferred label: Engraving @en
definition: Εκτυπώσεις σε χαρτί που περιλαμβάνουν αποτυπώσεις αντίστροφης σχεδίασης που δημιουργείται σε μια πλάκα εκτύπωσης, συνήθως χαλκού, στην οποία το σχέδιο έχει εγχυθεί (χαραγμένο)
narrower: Λιθογραφία
definition: Prints on paper incorporating impressions of a reverse design created on a printing plate, usually copper, into which the design has been incised (engraved). @en
type: Concept
broader: Δισδιάστατα γραφικά

Ντοκιμαντέρ
broader: Βίντεο
preferred label: Documentary @en
type: Concept

Οστέινο αντικείμενο
pref label in plural: Οστέινα αντικείμενα
pref label in plural: Bones (material) @en
broader: Τρισδιάστατα Αντικείμενα και Έργα Τέχνης
preferred label: Bone @en
type: Concept

Κεραμικό αντικείμενο
pref label in plural: Κεραμικό αντικείμενο
pref label in plural: Ceramics @en
broader: Τρισδιάστατα Αντικείμενα και Έργα Τέχνης
preferred label: Ceramic ware @en
type: Concept

Σενάριo
pref label in plural: Scripts @en
pref label in plural: Σενάρια
broader: Λογοτεχνικό έργο
preferred label: Script @en
type: Concept

Τηλεπικοινωνιακός εξοπλισμός
broader: Εργαλεία και εξοπλισμός
preferred label: Telecommunication equipment @en
type: Concept

Συνέντευξη
broader: Κείμενο
type: Concept
definition: "Statements, transcripts, or recordings of conversations in which one person obtains information from another such as for research purposes, publication, or broadcast. " @en
pref label in plural: Interviews @en
pref label in plural: Συνεντεύξεις
definition: Δηλώσεις, μεταγραφές ή καταγραφές συζητήσεων, στις οποίες ένα άτομο λαμβάνει πληροφορίες από ένα άλλο, είτε για ερευνητικούς σκοπούς, είτε για δημοσίευση, μετάδοση, ή άλλους λόγους.
distinct pref label: Συνέντευξη (κείμενο)
distinct pref label: Interview (text) @en
preferred label: Interview @en

Βιντεοσκόπηση θεατρικής παράστασης
pref label in plural: Theater play videorecordings @en
pref label in plural: Βιντεοσκoπήσεις θεατρικής παράστασης
broader: Βιντεοσκόπηση παράστασης
preferred label: Theater play videorecording @en
type: Concept

Στιγμιότυπο βίντεο
pref label in plural: Στιγμιότυπα βίντεο
pref label in plural: Video stills @en
broader: Φωτογραφία
preferred label: Video still @en
type: Concept

Εικονογράφηση
pref label in plural: Illustrations @en
pref label in plural: Εικονογραφήσεις
broader: Εικόνες και διακόσμηση έκδοσης
preferred label: Illustration (layout features) @en
type: Concept

Τεχνικό σχέδιο
definition: The broad class of drawings that are intended for constructional, mechanical, or mapping purposes and that follow precise conventions of scale and projection, including cross-sections, details, diagrams, elevations, perspectives, plans, etc., made for use in a technical context @en
narrower: Αρχιτεκτονικό σχέδιο
broader: Σχέδιο
pref label in plural: Τεχνικά σχέδια
type: Concept
pref label in plural: Technical drawings @en
definition: Η ευρεία κατηγορία σχεδίων που προορίζονται για κατασκευαστικούς, μηχανικούς ή χαρτογραφικούς σκοπούς και που ακολουθούν ακριβείς συμβάσεις κλίμακας και προβολής, συμπεριλαμβανομένων διατομών, λεπτομερειών, διαγραμμάτων, ανυψώσεων, προοπτικών, σχεδίων κ.λπ
preferred label: Technical drawing @en

Μουσικός δίσκος
pref label in plural: Phonograph records @en
pref label in plural: Μουσικοί δίσκοι
broader: Τρισδιάστατα Αντικείμενα και Έργα Τέχνης
alternative label: LP @en
preferred label: Phonograph record @en
type: Concept

Ποίημα
pref label in plural: Poems @en
pref label in plural: Ποιήματα
definition: Written or oral compositions characterized by condensed language chosen for sound and suggestive power as well as meaning, and by the use of such literary techniques as structured meter, natural cadences, rhyme, or metaphor @en
definition: Γραπτές ή προφορικές συνθέσεις που χρησιμοποιoύν αισθητικές και ρυθμικές ιδιότητες της γλώσσας, κατάλληλα επιλεγμένες για την ηχητική και υποδηλωτική τους ισχύ καθώς και συμπυκνωμένο νόημα. Στην ποίηση γίνεται χρήση λογοτεχνικών τεχνικών όπως δομημένο μέτρο, φυσικός ρυθμός, ομοιοκαταληξία και μεταφορά
broader: Λογοτεχνικό έργο
preferred label: Poem @en
type: Concept

Διήγημα
preferred label: Short story @en
definition: Relatively brief invented prose narratives @en
pref label in plural: Διηγήματα
definition: Έργο σύντομης σε έκταση αφηγηματικής πεζογραφίας
type: Concept
broader: Λογοτεχνικό έργο
pref label in plural: Short stories

Στατιστική
pref label in plural: Στατιστικές
definition: Αριθμητικά δεδομένα για ένα συγκεκριμένο θέμα που συγκεντρώνονται συστηματικά και συνήθως παρουσιάζονται σε πίνακες.
definition: Numerical data on a specific subject, systematically accumulated, often presented in tables @en
broader: Μελέτη
preferred label: Statistics @en
type: Concept

Έκθεση-Αναφορά
pref label in plural: Εκθέσεις-Αναφορές
pref label in plural: Reports @en
definition: Επίσημο ή τυπικό αρχείο ειδικής έρευνας, με τη μορφή εγγράφων που περιέχουν παρουσιάσεις γεγονότων, διαδικασιών, ερευνών ή συμβάντων
definition: Official or formal records of a special investigation, in the form of documents containing presentations of facts, proceedings, investigations, or events @en
broader: Έγγραφο
preferred label: Report @en
type: Concept

Γλυπτό
pref label in plural: Sculptures @en
pref label in plural: Γλυπτά
narrower: Ειδώλιο
broader: Τρισδιάστατα Αντικείμενα και Έργα Τέχνης
preferred label: Sculpture @en
type: Concept

Σφράγισμα
pref label in plural: Imprints @en
pref label in plural: Σφραγίσματα
broader: Σήμα (σύμβολο)
preferred label: Imprint @en
type: Concept

Έργο τέχνης μεικτής τεχνικής
type: Concept
definition: Έργα που δημιουργήθηκαν με χρήση πολλαπλών μέσων.
definition: Visual works created using multiple media. @en
pref label in plural: Mixed media works of art @en
pref label in plural: Έργα τέχνης μεικτής τεχνικής
distinct pref label: Mixed media work of art (2D) @en
broader: Δισδιάστατα γραφικά
preferred label: Mixed media work of art @en
distinct pref label: Έργο τέχνης μεικτής τεχνικής (δισδιάστατο)

Σελίδα βιβλίου
type: Concept
definition: " One side of a leaf (or sheet) of paper, parchment or other material (or electronic media) in a book, on which text or illustrations can be printed, written or drawn, to create documents." @en
pref label in plural: Book pages @en
broader: Τμήμα βιβλίου
broad match: http://vocab.getty.edu/aat/300194222
narrower: Σελίδα τίτλου
definition: Μία πλευρά ενός φύλλου χαρτιού, περγαμηνής ή άλλου υλικού (ή ηλεκτρονικών μέσων) σε ένα βιβλίο, πάνω στο οποίο μπορούν να εκτυπωθούν, να γραφτούν ή να συνταχθούν κείμενο ή εικονογραφήσεις για τη δημιουργία εγγράφων.
preferred label: Book page @en
broad match: Page (paper)
pref label in plural: Σελίδες βιβλίου

Άλμπουμ/Λεύκωμα
pref label in plural: Άλμπουμ/Λευκώματα
pref label in plural: Albums @en
broader: Τρισδιάστατα Αντικείμενα και Έργα Τέχνης
preferred label: Album @en
type: Concept

Ψηφιδωτό
pref label in plural: Mosaic @en
pref label in plural: Ψηφιδωτό
definition: Images or patterns composed of small, regularly shaped pieces of durable material, usually stone or colored glass. @en
definition: Εικόνες ή μοτίβα που αποτελούνται από μικρά, με συστηματικό τρόπο διαμορφωμένα κομμάτια ανθεκτικού υλικού, συνήθως πέτρας ή έγχρωμου γυαλιού.
broader: Δισδιάστατα γραφικά
preferred label: Mosaic @en
type: Concept

Μελέτη
pref label in plural: Μελέτες
preferred label: Study @en
alternative label: Research @en
broader: Κείμενο
pref label in plural: Studies @en
definition: Detailed investigation and analysis of a subject or a situation @en
narrower: Στατιστική
definition: Λεπτομερής έρευνα και ανάλυση ενός θέματος ή μιας συνθήκης
type: Concept

Απόκομμα
type: Concept
definition: Illustrations, pages, articles, or columns of text removed from books, newspapers, journals, or other printed sources and kept for their informational content. @en
definition: Εικονογραφήσεις, σελίδες, άρθρα ή στήλες κειμένου που έχουν αφαιρεθεί από βιβλία, εφημερίδες, περιοδικά ή άλλες τυπωμένες πηγές και διατηρούνται για το ενημερωτικό τους περιεχόμενο.
distinct pref label: Clipping (text) @en
distinct pref label: Απόκομμα (κείμενο)
preferred label: Clipping @en
broader: Κείμενο
pref label in plural: Αποκόμματα
pref label in plural: Clipings @en

Αυτοβιογραφία
pref label in plural: Autobiographies @en
pref label in plural: Αυτοβιογραφίες
definition: Είδος που περιλαμβάνει τα λογοτεχνικά έργα απολογισμού και εξιστόρησης της ζωής ενός ατόμου όπως δίνεται από τον ίδιο.
definition: Literary genre of accounts of a person's life given by themselves @en
broader: Λογοτεχνικό έργο
preferred label: Autobiography @en
type: Concept

Βιογραφία
pref label in plural: Biographies @en
pref label in plural: Βιογραφίες
definition: Είδος που περιλαμβάνει τα λογοτεχνικά έργα λεπτομερούς καταγραφής της ζωής ενός ατόμου
definition: The genre of nonfiction that concerns accounts of the lives of individuals @en
broader: Λογοτεχνικό έργο
preferred label: Biography @en
type: Concept

Διαβατήριο
pref label in plural: Passports @en
pref label in plural: Διαβατήρια
broader: Πιστοποιητικό
preferred label: Passport @en
type: Concept

Σύνολα δεδομένων
narrower: Σύνολο δεδομένων
preferred label: Datasets @en
type: Concept

Ηλεκτρονικός υπολογιστής
pref label in plural: Ηλεκτρονικοί υπολογιστές
pref label in plural: Computers @en
broader: Μηχάνημα
preferred label: Computer @en
type: Concept

Βιβλίο
pref label in plural: Books @en
definition: Υλικός φορέας γραπτού ή εικαστικού περιεχομένου, που αποτελείται από έναν αριθμό συνδεδεμένων τεμαχίων χαρτιού (συρραφή ή συγκόλληση αυτών) καθώς και εξώφυλλο. Κάθε φύλλο και σελίδα χαρτιού μπορεί να είναι είτε κενή, είτε γραμμένη. Σε προγενέστερες εποχές, το βιβλίο συνιστούσε συλλογή περγαμηνών, ξύλου, σκληρυμένου κλωστοϋφαντουργικού προϊόντος, ελεφαντόδοντου, μεταλλικών δισκίων ή άλλων επίπεδων υλικών. Στις μέρες μας ωστόσο, συναντά κανείς και το βιβλίο σε ηλεκτρονική μορφή (e-book).
preferred label: Book @en
definition: Items comprising a collection of leaves of paper, parchment, wood, stiffened textile, ivory, metal tablets, or other flat material, that are blank, written on, or printed, and are strung or bound together in a volume. @en
pref label in plural: Βιβλία
broader: Κείμενο
type: Concept
narrower: Λεξικό
narrower: Κώδικας

Χειρόγραφο
pref label in plural: Χειρόγραφα
pref label in plural: Manuscripts @en
broader: Κείμενο
preferred label: Manuscript @en
type: Concept

Εφήμερα
definition: Printed works that are created to meet an array of immediate needs, usually transitory in nature not intended to be saved. Examples could be posters, leaflets, programs, postcards, tradecards, labels, tickets, handbills, sale notices, and valentines. @en
definition: Υλικό της καθημερινής ζωής που παρήχθη σε μεγάλες ποσότητες και από ευτελείς πρώτες ύλες για να εξυπηρετήσει συγκεκριμένες και πρόσκαιρες ανάγκες και δεν προορίζεται για να διατηρηθεί. Στην κατηγορία εφήμερα ανήκουν τα ψηφοδέλτια, τα προγράμματα εκδηλώσεων, οι αφίσες, οι συσκευασίες τροφίμων, ετικέτες, τα εισιτήρια, οι έντυπες αγγελίες κ.ά.
broader: Δισδιάστατα γραφικά
preferred label: Ephemera @en
type: Concept

Λόγος, Διαλέξη
pref label in plural: Speeches, lectures @en
broader: Κείμενο
definition: Το κείμενο μιας διάλεξης. Ως διαλέξεις νοούνται οι εκθέσεις ενός συγκεκριμένου θέματος που παραδίδονται ενώπιον ενός ακροατηρίου ή μιας τάξης, ειδικά για σκοπούς διδασκαλίας
distinct pref label: Speech, Lecture (text) @en
definition: Expositions of a given subject delivered before an audience or class, especially for the purposes of instruction @en
distinct pref label: Λόγος, Διαλέξη (κείμενο)
preferred label: Speech, Lecture @en
pref label in plural: Λόγοι, διαλέξεις
type: Concept

Κινηματογραφικό έργο
pref label in plural: Films @en
pref label in plural: Κινηματογραφικά έργα
broader: Πολιτιστική παραγωγή
preferred label: Film @en
type: Concept

Συνέντευξη
definition: Δηλώσεις, μεταγραφές ή καταγραφές συζητήσεων, στις οποίες ένα άτομο λαμβάνει πληροφορίες από ένα άλλο, είτε για ερευνητικούς σκοπούς, είτε για δημοσίευση, μετάδοση, ή άλλους λόγους.
broader: Ηχογράφηση
distinct pref label: Interview (recording) @en
preferred label: Interview @en
type: Concept
pref label in plural: Συνεντεύξεις @en
definition: "Statements, transcripts, or recordings of conversations in which one person obtains information from another such as for research purposes, publication, or broadcast. " @en
distinct pref label: Συνέντευξη (ηχογράφηση)
pref label in plural: Interviews

Πρωτοσέλιδο εφημερίδας
pref label in plural: Newspaper headlines @en
pref label in plural: Πρωτοσέλιδα εφημερίδας
definition: The first, and initially visible, page of a newspaper. @en
definition: Η πρώτη και αρχικά ορατή σελίδα μιας εφημερίδας.
broader: Τμήμα εφημερίδας
alternative label: Newspaper headline @en
preferred label: Headline @en
type: Concept

Περιοδική έκδοση
preferred label: Serial publication @en
definition: Publications in any medium issued in successive parts bearing numerical or chronological designations and intended to be continued indefinitely, such as periodicals, newspapers, annuals (reports, yearbooks, etc.), journals, memoires, proceedings, transactions, etc., of societies and numbered monographic series. @en
narrower: Φύλλο εφημερίδας
broader: Κείμενο
narrower: Περιοδικό
definition: Δημοσιεύσεις σε οποιοδήποτε μέσο, οι οποίες εκδίδονται σε διαδοχικά τμήματα που φέρουν είτε αριθμητικές είτε χρονολογικές ονομασίες και προορίζονται να συνεχιστούν επ 'αόριστον. Χαρακτηριστικό παράδειγμα αποτελούν τα περιοδικά, οι εφημερίδες, τα ετήσια δελτία, κ.ά.
pref label in plural: Περιοδικές εκδόσεις
type: Concept
pref label in plural: Serial publications @en

Καρτέλα ευρετηρίου
pref label in plural: Καρτέλες ευρετηρίου
pref label in plural: Index cards @en
broader: Ευρετήριο
preferred label: Card index @en
type: Concept

Νομικό κείμενο
pref label in plural: Legal documents @en
definition: Έγγραφα που έχουν γενικά νομική συνάφεια
type: Concept
definition: Documents having legal relevance in general. @en
pref label in plural: Νομικά κείμενα
alternative label: Νομικό Έγγραφο
broader: Έγγραφο
preferred label: Legal document @en

Σκεύος
pref label in plural: Vessels @en
pref label in plural: Σκεύη
narrower: Αγγείο
broader: Τρισδιάστατα Αντικείμενα και Έργα Τέχνης
preferred label: Vessel @en
type: Concept

Διαφημιστικό σποτ
pref label in plural: Διαφημιστικά σποτ
pref label in plural: Commercial spots @en
broader: Βίντεο
preferred label: Commercial spot @en
type: Concept

Λόγος, Διαλέξη
pref label in plural: Λόγοι, διαλέξεις
definition: Addresses or discourses having a more or less formal character and composed for the purpose of delivering the content orally to an audience or assembly. @en
distinct pref label: Speech, Lecture (recording) @en
type: Concept
preferred label: Speech, Lecture @en
pref label in plural: Speeches, lectures @en
distinct pref label: Λόγος, Διαλέξη (ηχογράφηση)
definition: Απευθύνσεις ή ομιλίες που έχουν περισσότερο ή λιγότερο επίσημο χαρακτήρα και συντάχθηκαν με σκοπό να εκφωνηθούν σε ακροατήριο ή συνέλευση.
broader: Ηχογράφηση

Μουσικό άλμπουμ / Άλμπουμ ηχογράφησης
pref label in plural: Music Albums @en
pref label in plural: Μουσικα Άλμπουμ
distinct pref label: Music Album (production) @en
distinct pref label: Μουσικό Άλμπουμ (παραγωγή)
broader: Πολιτιστική παραγωγή
preferred label: Music album / Sound recording album @en
type: Concept

Δισκίο
pref label in plural: Disks @en
pref label in plural: Δισκία
broader: Τρισδιάστατα Αντικείμενα και Έργα Τέχνης
preferred label: Disk @en
type: Concept

Κούκλα
pref label in plural: Κούκλες
pref label in plural: Dolls
broader: Παιχνίδι
preferred label: Doll @en
type: Concept

Θεατρική παράσταση
pref label in plural: Θεατρικές παραστάσεις
pref label in plural: Plays @en
definition: Δραματική παράσταση που παρουσιάζεται από ηθοποιούς ενώπιον ακροατηρίου
broader: Πολιτιστική παραγωγή
preferred label: Play @en
type: Concept

Ειδώλιο
pref label in plural: Ειδώλια
pref label in plural: Figurines @en
broader: Γλυπτό
preferred label: Figurine @en
type: Concept

Μετάλλιο
pref label in plural: Medals @en
pref label in plural: Μετάλλια
broader: Τρισδιάστατα Αντικείμενα και Έργα Τέχνης
preferred label: Medal @en
type: Concept

Ημερολόγιο/Σημειωματάριο
pref label in plural: Diaries/ Notebooks @en
pref label in plural: Ημερολόγια/ Σημειωματάρια
definition: Books containing the daily, personal accounts of the writer's own experiences, attitudes, and observations. @en
definition: Bιβλία που περιέχουν τους καθημερινούς, προσωπικούς απολογισμούς των εμπειριών, των διαθέσεων και των παρατηρήσεων του συγγραφέα
broader: Κείμενο
preferred label: Diary/Notebook @en
type: Concept

Τμήμα εφημερίδας
pref label in plural: Newspaper parts @en
pref label in plural: Τμήματα εφημερίδας
narrower: Πρωτοσέλιδο εφημερίδας
broader: Τμήμα έκδοσης
preferred label: Newspaper part @en
type: Concept

Απομνημονεύματα
definition: Αφηγήσεις ή ιστορίες αυτοβιογραφικού χαρακτήρα με έμφαση στην προσωπική εμπειρία του συγγραφέα από τα γεγονότα.
definition: Narratives or histories autobiographical in nature or stressing the author's personal experience of the events @en
broader: Λογοτεχνικό έργο
preferred label: Memoirs @en
type: Concept

Κατάλογος
broader: Κείμενο
definition: Enumerations of items, such as a file of bibliographic records or a list of art objects, usually arranged systematically and with descriptive details; may be in book or pamphlet form, on cards, or online. @en
type: Concept
narrower: Τηλεφωνικός κατάλογος
definition: Λίστα αντικειμένων που ανήκουν στην ίδια συλλογή ή έκτίθενται μαζί, ή παρέχονται από κοινό διαθέτη (π.χ. εκδότη ή βιβλιοπωλείο).
preferred label: Catalogue @en
pref label in plural: Catalogues @en
pref label in plural: Κατάλογοι

Παραμύθι
definition: Παραδοσιακές ιστορίες ή θρύλοι ενός πολιτισμού που μεταφέρονται από τη μια γενιά στην επόμενη, συχνά με προφορικό τρόπο
definition: Traditional stories or legends in a given culture that are passed down over time, often orally @en
broader: Λογοτεχνικό έργο
preferred label: Folktale @en
type: Concept

Δελτίο ταυτότητας
pref label in plural: Identity cards @en
pref label in plural: Δελτία ταυτότητας
broader: Πιστοποιητικό
preferred label: Identity card @en
type: Concept

Τηλεφωνική συσκευή
pref label in plural: Τηλεφωνικές συσκευές
pref label in plural: Telephones @en
broader: Μηχάνημα
preferred label: Telephone @en
type: Concept

Μουσικό κομμάτι
pref label in plural: Music tracks @en
pref label in plural: Μουσικά κομμάτια
definition: Στάδια της μουσικής δημιουργικής διαδικασίας, κατά τη διάρκεια των οποίων μουσικές ιδέες υλοποιούνται και μεταδίδονται στον ακροατή.
definition: Phases in the creative process during which musical ideas are realized and transmitted to a listener @en
broader: Ηχογράφηση
preferred label: Music track @en
type: Concept

Αφιερωματική κάρτα Αγίων
pref label in plural: Αφιερωματικές κάρτες Αγίων
pref label in plural: Santini @en
definition: Τυπωμένη κάρτα που φέρει στη μια πλευρά την εικόνα ενός ιερού προσώπου ή ένα θρησκευτικό θέμα και στην άλλη πλευρά μία προσευχή.
broader: Κάρτα
preferred label: Santino @en
type: Concept

Τρισδιάστατο μοντέλο από 3D σάρωση
pref label in plural: 3d scans @en
pref label in plural: Τρισδιάστατα μοντέλα από 3D σάρωση
broader: Τρισδιάστατη αναπαράσταση
preferred label: 3D model from scanning @en
type: Concept

Νόμισμα
pref label in plural: Coins @en
pref label in plural: Νομίσματα
broader: Τρισδιάστατα Αντικείμενα και Έργα Τέχνης
preferred label: Coin @en
type: Concept

Τεκμήριο συνεδρίου
pref label in plural: Τεκμήρια συνεδρίου
pref label in plural: Conference items @en
broader: Ηχογράφηση
preferred label: Conference item @en
type: Concept

Ευχετήρια κάρτα
pref label in plural: Greeting cards @en
pref label in plural: Ευχετήριες κάρτες
definition: Κάρτα που αποστέλλεται ή δίνεται σε ειδικές περιπτώσεις. Συνήθως φέρει ευχές.
broader: Κάρτα
preferred label: Greeting card @en
type: Concept

Τυπογραφικά στοιχεία
broader: Τμήμα έκδοσης
preferred label: Script and type forms @en
type: Concept

Στίχοι τραγουδιού
broader: Λογοτεχνικό έργο
preferred label: Lyrics @en
type: Concept

Προφορική ιστορία
pref label in plural: Προφορικές ιστορίες
pref label in plural: Oral histories @en
broader: Βίντεο
preferred label: Oral history @en
type: Concept

Άυλη πολιτιστική κληρονομιά
definition: Συνιφασμένες με την πολιτιστική κληρονομιά πρακτικές, αναπαραστάσεις,εκφράσεις, γνώση, ικανότητες - καθώς και όργανα, αντικείμενα, τεχνουργήματα και πολιτισμικοί χώροι συσχετισμένοι με αυτά.
definition: Practices, representations, expressions, knowledge, skills – as well as the instruments, objects, artefacts and cultural spaces associated therewith – that communities, groups and, in some cases, individuals recognize as part of their cultural heritage. @en
narrower: Παροιμία
narrower: Λαϊκή Παράδοση
preferred label: Intangible cultural heritage @en
type: Concept

Πιστοποιητικό
pref label in plural: Πιστοποιητικά
pref label in plural: Certificates @en
narrower: Διαβατήριο
narrower: Δελτίο ταυτότητας
broader: Έγγραφο
preferred label: Certificate @en
type: Concept

Έγγραφο
narrower: Πιστοποιητικό
type: Concept
broader: Κείμενο
narrower: Επιστολή
preferred label: Document @en
narrower: Έκθεση-Αναφορά
narrower: Νομικό κείμενο
narrower: Τηλεγράφημα

Τηλεγράφημα
pref label in plural: Telegrams @en
pref label in plural: Τηλεγραφήματα
broader: Έγγραφο
preferred label: Telegram @en
type: Concept

Βιντεοσκόπηση συναυλίας
pref label in plural: Βιντεοσκοπήσεις συναυλιών
pref label in plural: Concert videorecordings @en
broad match: Q430525
broader: Βιντεοσκόπηση παράστασης
preferred label: Concert videorecording @en
type: Concept

Αφίσα
pref label in plural: Posters @en
pref label in plural: Αφίσες
definition: Ειδοποιήσεις, συνήθως διακοσμητικές ή εικονογραφικές, που προορίζονται να τοποθετηθούν για να διαφημίσουν, να προωθήσουν ή να δημοσιοποιήσουν μια δραστηριότητα, σκοπό, προϊόν ή υπηρεσία. Επίσης, διακοσμητικές, μαζικής παραγωγής εκτυπώσεις που προορίζονται για ανάρτηση.
definition: Νotices, usually decorative or pictorial, intended to be posted to advertise, promote, or publicize an activity, cause, product, or service; also, decorative, mass-produced prints intended for hanging.
broader: Έντυπο υλικό
preferred label: Poster @en
type: Concept

Εκτύπωση
pref label in plural: Prints @en
definition: Εικονογραφικά έργα που παράγονται με την μεταφορά εικόνων, κειμένων, κ.λπ., πάνω σε χαρτί ή άλλο υλικό με την χρήση μίας από τις τυπογραφικές μεθόδους (διαδικασίες εκτύπωσης).
preferred label: Print @en
type: Concept
narrower: Έντυπο υλικό
narrower: Χαρτονόμισμα
pref label in plural: Εκτυπώσεις
narrower: Σήμα (σύμβολο)
definition: Pictorial works produced by transferring images by means of a matrix such as a plate, block, or screen, using any of various printing processes. @en
narrower: Τυπογραφικό δοκίμιο
narrower: Κάρτα
narrower: Γραμματόσημο
broader: Δισδιάστατα γραφικά

Αθλητικός εξοπλισμός
broader: Εργαλεία και εξοπλισμός
preferred label: Sports and athletic equipment @en
type: Concept

Αρχιτεκτονικό σχέδιο
pref label in plural: Αρχιτεκτονικά σχέδια
pref label in plural: Architectural drawings @en
definition: Drawings of architecture and drawings for architectural projects, whether the project was executed or not. The term may also refer to any image in a two-dimensional medium that serves this same purpose, including prints and computer images @en
definition: Σχέδια αρχιτεκτονικής και σχέδια για αρχιτεκτονικά έργα, ανεξάρτητα από το εάν το έργο εκτελέστηκε ή όχι. Αποτυπώνουν το σχεδιασμό και την υλοποίηση διαφόρων κατασκευών, όπως χώρων (π.χ. πόλεων), κτιρίων, οικοδομών με έμφαση στην εργονομία και στην αισθητική τους. Ο όρος μπορεί επίσης να αναφέρεται σε οποιαδήποτε εικόνα σε ένα δισδιάστατο μέσο που εξυπηρετεί τον ίδιο σκοπό, συμπεριλαμβανομένων των εκτυπώσεων και των εικόνων του υπολογιστή.
broader: Τεχνικό σχέδιο
preferred label: Architectural drawing @en
type: Concept

Προφορική ιστορία
pref label in plural: Προφορικές ιστορίες
pref label in plural: Oral histories @en
definition: Generally, giving an account. In the context of journalism, gathering and writing, or narrating by phone or broadcast, news events for newspapers, radio, or television @en
definition: Η προφορική εξιστόρηση ενός γεγονότος ή μιας σειράς γεγονότων που είτε συνέβησαν είτε προέκυψαν από τη φαντασία κάποιου
broader: Ηχογράφηση
preferred label: Oral history @en
type: Concept

Λιθογραφία
pref label in plural: Lithographs @en
pref label in plural: Λιθογραφίες
definition: Εκτυπώσεις που παράγονται με την τεχνική της λιθογραφίας κατά την οποία η σχεδιαστική αναπαράσταση τοποθετείται πάνω σε μεταλλικές ή πέτρινες πλάκες.
definition: Prints made using the process of lithography, which is a planographic printing process in which a design is deposited on the stone or plate with a greasy substance which will accept ink. @en
broader: Έργο χαρακτικής
preferred label: Lithography @en
type: Concept

Διάγραμμα
pref label in plural: Charts @en
pref label in plural: Διαγράμματα
definition: A tabular or graphic representation of a fluctuating or dependent variable, such as magnitude, temperature, cost, etc. @en
definition: Μια πινακοειδής ή γραφική αναπαράσταση μιας κυμαινόμενης ή εξαρτώμενης μεταβλητής, όπως μέγεθος, θερμοκρασία, κόστος κλπ.
broader: Σχέδιο
preferred label: Chart @en
type: Concept

Σελίδα τίτλου
broader: Σελίδα βιβλίου
preferred label: Title page @en
type: Concept

Τεκμήριο εκδήλωσης
pref label in plural: Event items @en
pref label in plural: Τεκμήρια εκδήλωσης
broader: Κείμενο
preferred label: Event item @en
type: Concept

Όστρακο
pref label in plural: Pottery fragments @en
pref label in plural: Ostraca @en
pref label in plural: Όστρακα
broader: Θραύσμα
preferred label: Ostracon @en
type: Concept

Κολάζ
definition: Work in two dimensions or very low relief that was made by gluing paper, fabrics, photographs, or other materials onto a flat surface @en
definition: Έργο σε δύο διαστάσεις ή σε πολύ χαμηλό ανάγλυφο που έγινε με κόλληση χαρτιού, υφασμάτων, φωτογραφιών ή άλλων υλικών σε μια επίπεδη επιφάνεια
broader: Δισδιάστατα γραφικά
preferred label: Collage @en
type: Concept

Ξυλόγλυπτο
pref label in plural: Woodcarvings @en
pref label in plural: Ξυλόγλυπτα
broader: Τρισδιάστατα Αντικείμενα και Έργα Τέχνης
preferred label: Woodcarving @en
type: Concept

Γραμματόσημο
broader: Εκτύπωση
definition: Εγκριθέντα από την κυβέρνηση τυπωμένα αυτοκόλλητα, χάρτινες σφραγίδες ή σημάνσεις μετρητών που εκδίδονται ως απόδειξη της προπληρωμής των ταχυδρομικών τελών.
type: Concept
preferred label: Stamp @en
pref label in plural: Γραμματόσημα
pref label in plural: Stamps @en
alternative label: postage stamp @en
definition: Government-authorized adhesive stamps, imprinted stamps, hand stamps, or meter markings issued as evidence of prepayment of postage. @en

Κώδικας
pref label in plural: Codices @en
pref label in plural: Κώδικες
broader: Βιβλίο
preferred label: Codex @en
type: Concept

Σήμα (σύμβολο)
pref label in plural: Identifying markings @en
pref label in plural: Σήματα (σύμβολα)
broader: Εκτύπωση
preferred label: Identifying marking @en
type: Concept

Αγγείο
pref label in plural: Αγγεία
pref label in plural: Vases @en
broader: Σκεύος
preferred label: Vase @en
type: Concept

Φυλλάδιο
pref label in plural: Leaflets @en
pref label in plural: Φυλλάδια
distinct pref label: Leaflet (text) @en
distinct pref label: Φυλλάδιο (κείμενο)
broader: Κείμενο
preferred label: Leaflet @en
type: Concept

Διατριβή
pref label in plural: Dissertations @en
pref label in plural: Διατριβές
definition: Πρωτότυπο κείμενο έρευνας για ένα θέμα που συνήθως προετοιμάζεται και παρουσιάζεται ως η τελική απαίτηση για την απόκτηση ενός διπλώματος ή πτυχίου. Μια διατριβή κατά το πλείστον βασίζεται στην ανεξάρτητη έρευνα του υποψηφίου, γεγονός που επιβεβαιώνει και αποδεικνύει την ορθή ακαδημαική του μεθοδολογία και την γνώση που έχει επί του αντικειμένου που μελέτησε.
definition: Written treatises, or the records of a discourse on a subject, usually prepared and presented as the final requirement for a degree or diploma and typically based on independent research and giving evidence of the candidate's mastery of the subject and of scholarly method. @en
broader: Κείμενο
preferred label: Dissertation or thesis (original) @en
type: Concept

Τεκμήριο συνεδρίου
pref label in plural: Τεκμήρια συνεδρίου
pref label in plural: Conference items @en
broader: Βίντεο
preferred label: Conference item @en
type: Concept

Κόσμημα
pref label in plural: Jewellery @en
pref label in plural: Κοσμήματα
broader: Τρισδιάστατα Αντικείμενα και Έργα Τέχνης
preferred label: Jewellery @en
type: Concept

Λεξικό
pref label in plural: Dictionaries @en
pref label in plural: Λεξικά
definition: Πηγές αναφοράς που συστηματικά συγκεντρώνουν και ταξινομούν τις λέξεις σε αλφαβητική ή άλλη σειρά, παρέχοντας για την κάθε μία ποικίλες πληροφορίες (γραμματικές, συντακτικές, ερμηνευτικές, ετυμολογικές, αποδόσεις σε άλλη γλώσσα κλπ)
definition: "Reference sources containing alphabetical lists of words with information given for each word; generally including meanings, pronunciation, etymology, and often usage guidance. " @en
broader: Βιβλίο
preferred label: Dictionary @en
type: Concept

Εικόνες και διακόσμηση έκδοσης
narrower: Εικονογράφηση
broader: Δισδιάστατα γραφικά
preferred label: Images and ornament for layout features @en
type: Concept

Τμήμα έκδοσης
type: Concept
narrower: Τμήμα βιβλίου
narrower: Τμήμα περιοδικού
preferred label: Partial document @en
pref label in plural: Τμήματα εκδόσεων
narrower: Τυπογραφικά στοιχεία
pref label in plural: Partial documents
narrower: Τμήμα εφημερίδας
definition: Τμήματα εγγράφων ή άλλων γραπτών έργων, τα οποία είτε περιλαμβάνονται ως διακεκριμένοι τομείς σε ένα υπάρχον έγγραφο, είτε βρίσκονται αποσπασμένα από το πρωτότυπο (έγγραφο).
definition: Portions of documents or other written works, either included as discrete sections in an extant document or detached from the original document. @en
broader: Κείμενο

Σημείωμα
pref label in plural: Notes @en
pref label in plural: Σημειώματα
broader: Κείμενο
preferred label: Note @en
type: Concept

Κορνίζα
pref label in plural: Frames @en
pref label in plural: Κορνίζες
broader: Τρισδιάστατα Αντικείμενα και Έργα Τέχνης
preferred label: Frame @en
type: Concept

Ζωγραφικό σχέδιο / Σκίτσο
pref label in plural: Sketches @en
pref label in plural: Ζωγραφικά σχέδια / Σκίτσα
definition: Rough or summary art works; less finished than studies. @en
definition: Πρόχειρα ή συνοπτικά ζωγραφικά έργα τέχνης. Λιγότερο ολοκληρωμένα από τις μελέτες.
broader: Σχέδιο
preferred label: Sketch @en
type: Concept

Τρισδιάστατα Αντικείμενα και Έργα Τέχνης
narrower: Μοντέλο
narrower: Παιχνίδι
narrower: Φαγητό
narrower: Άλμπουμ/Λεύκωμα
narrower: Πρωτότυπο
narrower: Προσωπικό αντικείμενο (αξεσουάρ)
narrower: Κορνίζα
narrower: Μάσκα
narrower: Σκεύος
narrower: Κτίριο
narrower: Γλυπτό
narrower: Ταφικό αντικείμενο
narrower: Φυσικό δείγμα
narrower: Έργο τέχνης μεικτής τεχνικής
narrower: Φιγούρα θεάτρου σκιών
narrower: Ξυλόγλυπτο
narrower: Μετάλλιο
narrower: Έλασμα
type: Concept
narrower: Μεταφορικό μέσο
narrower: Κεραμικό αντικείμενο
narrower: Πλακίδιο
narrower: Κόσμημα
narrower: Οστέινο αντικείμενο
narrower: Ανάγλυφο
narrower: Δισκίο
narrower: Έργο θρησκευτικής τέχνης
narrower: Ενδυμασία
narrower: Εργαλεία και εξοπλισμός
narrower: Πινακίδα
preferred label: 3D Αrtefacts and Realia @en
narrower: Θραύσμα
narrower: Αναμνηστικό αντικείμενο (σουβενίρ)
narrower: Αντίγραφο
narrower: Μουσικός δίσκος
narrower: Σήμα (σύμβολο)
narrower: Επιγραφή
narrower: Αρχιτεκτονικό μέλος
narrower: Αρχαιολογικός χώρος
narrower: Αρχαιολογικό αντικείμενο
narrower: Ύφασμα
narrower: Νόμισμα
narrower: Σφραγίδα
narrower: Εγκατάσταση
narrower: Έπαθλο

Τεκμήριο συνεδρίου
pref label in plural: Τεκμήρια συνεδρίου
pref label in plural: Conference items @en
broader: Κείμενο
preferred label: Conference item @en
type: Concept

Μαγνητοσκόπηση
pref label in plural: Βιντεοσκοπήσεις
pref label in plural: Video recordings @en
broader: Βίντεο
preferred label: Videorecording @en
type: Concept

Χαρτονόμισμα
preferred label: Banknote @en
definition: Εγκριθέντα από την κυβέρνηση μέσα συναλλαγής τυπωμένα σε χαρτί
alternative label: banknote @en
type: Concept
alternative label: Τραπεζογραμμάτιο
pref label in plural: Χαρτονομίσματα
definition: Officially circulating media of exchange manufactured from paper @en
pref label in plural: Banknotes @en
broader: Εκτύπωση

Λειτουργικό αντικείμενο
pref label in plural: Λειτουργικά αντικείμενα
pref label in plural: Lliturgical objects @en
broader: Εργαλεία και εξοπλισμός
preferred label: Lliturgical object @en
type: Concept

Άρθρο
pref label in plural: Articles @en
pref label in plural: Άρθρα
definition: Literary compositions prepared for publication as an independent portion of a magazine, newspaper, encyclopedia, or other work. @en
definition: Οι λογοτεχνικές συνθέσεις που προορίζονται για δημοσίευση ως ανεξάρτητο τμήμα ενός περιοδικού, εφημερίδας, εγκυκλοπαίδειας ή άλλης εργασίας.
broader: Κείμενο
preferred label: Article @en
type: Concept

Έργο ζωγραφικής
definition: Unique works in which images are formed primarily by the direct application of pigments onto a generally two-dimensional surface. @en
type: Concept
preferred label: Painting @en
alternative label: Ζωγραφικό έργο
definition: Μοναδικά έργα στα οποία οι εικόνες σχηματίζονται κατά κύριο λόγο από την άμεση εφαρμογή χρωστικών πάνω σε μια δισδιάστατη επιφάνεια.
broader: Δισδιάστατα γραφικά
narrower: Τοιχογραφία
pref label in plural: Έργα ζωγραφικής
pref label in plural: Paintings @en

Μουσικό όργανο
pref label in plural: Μουσικά όργανα
pref label in plural: Musical instruments @en
broader: Εργαλεία και εξοπλισμός
preferred label: Musical instrument @en
type: Concept

Ναός
pref label in plural: Temples @en
pref label in plural: Ναοί
broader: Κτίριο
preferred label: Temple @en
type: Concept

Πρόγραμμα
pref label in plural: Προγράμματα
pref label in plural: Programs @en
definition: Τυπωμένες ή γραπτές λίστες των πράξεων, σκηνών, επιλογών ή άλλων χαρακτηριστικών που συνθέτουν μια παράσταση, συμπεριλαμβανομένων των ονομάτων των συμμετεχόντων.
definition: Brief outlines or explanations of the order to be pursued, criteria for participation, or the subjects embraced in a given event or endeavor. Includes lists of the features composing a dramatic or other performance, with the names of participants. @en
broader: Έντυπο υλικό
preferred label: Program @en
type: Concept

Αντίγραφο
pref label in plural: Replicas @en
pref label in plural: Αντίγραφα
distinct pref label: Αντίγραφο (τρισδιάστατο)
distinct pref label: Replica (3D) @en
broader: Τρισδιάστατα Αντικείμενα και Έργα Τέχνης
preferred label: Replica @en
type: Concept

Όπλο
pref label in plural: Weapons @en
pref label in plural: Όπλα
pref label in plural: Guns @en
broader: Εργαλεία και εξοπλισμός
preferred label: Arm @en
type: Concept

Αρχείο εικονικής πραγματικότητας
pref label in plural: Αρχεία εικονικής πραγματικότητας
broader: Τρισδιάστατη αναπαράσταση
preferred label: Virtual Reality @en
type: Concept

Λαογραφικό δελτίο
pref label in plural: Λαογραφικά δελτία
pref label in plural: Folklore field cards @en
definition: Ένα λαογραφικό δελτίο είναι ένα ειδικό έντυπο ή χειρόγραφο φύλλο καταγραφής που χρησιμοποιούσαν οι λαογράφοι (ειδικά στην Ελλάδα από τον 19ο αιώνα μέχρι τα μέσα του 20ού) για να συλλέξουν συστηματικά στοιχεία προφορικής παράδοσης από έναν τόπο.
broader: Κείμενο
alternative label: Field notes @en
preferred label: Folklore field card @en
type: Concept

Πολιτιστική παραγωγή
narrower: Κινηματογραφικό έργο
type: Concept
narrower: Μουσικό κομμάτι
pref label in plural: Πολιτιστικές παραγωγές
pref label in plural: Cultural productions @en
narrower: Θεατρική παράσταση
narrower: Μουσικό άλμπουμ / Άλμπουμ ηχογράφησης
narrower: Χορευτική παράσταση
narrower: Πολιτιστική Εκδήλωση
preferred label: Cultural production @en
narrower: Συναυλία

Αυτοκόλλητη ετικέτα
pref label in plural: Αυτοκόλλητες ετικέτες
broader: Έντυπο υλικό
pref label in plural: Stickers @en
definition: Adhesive-backed slips of paper or similar thin material, usually bearing messages or designs. @en
type: Concept
definition: Μια αυτοκόλλητη ετικέτα είναι ένα κομμάτι τυπωμένου χαρτιού, πλαστικού, βινυλίου, ή άλλου παρόμοιου λετπού υλικού, όπου η μία από τις δύο του όψεις διαθέτει κόλλα ευαίσθητη στην πίεση. Στο σύνολό τους, οι αυτοκόλλητες ετικέτες μπορούν να χρησιμοποιηθούν για διακόσμηση ή για λειτουργικούς σκοπούς, ανάλογα με την κατάσταση. Συνήθως φέρουν μηνύματα ή σχέδια.
preferred label: Sticker @en

Εγκατάσταση
pref label in plural: Installations @en
pref label in plural: Εγκαταστάσεις
broader: Τρισδιάστατα Αντικείμενα και Έργα Τέχνης
preferred label: Installation @en
type: Concept

Μουσικό κομμάτι
pref label in plural: Music tracks @en
pref label in plural: Μουσικά κομμάτια
broader: Πολιτιστική παραγωγή
preferred label: Music track @en
type: Concept

Σύνολο δεδομένων
pref label in plural: Datasets @en
pref label in plural: Σύνολα δεδομένων
definition: Περιεχόμενο που εκφράζεται μέσα από ένα ψηφιακά κωδικοποιημένο σύνολο δεδομένων προορισμένο για επεξεργασία από υπολογιστή. Περιλαμβάνει αριθμητικά δεδομένα, περιβαλλοντικά δεδομένα, κλπ., που χρησιμοποιούνται από εφαρμογές λογισμικού για τον υπολογισμό μέσων όρων, συσχετίσεων, κ.α., ή για την παραγωγή μοντέλων, αλλά συνήθως δεν παρουσιάζονται σε ακατέργαστη μορφή. Για δεδομένα που παρουσιάζονται στη μορφή παρτιτούρων, εικόνων, κειμένου, τρισδιάστατων αντικειμένων ή ηχογραφήσεων βλ. αντίστοιχο τύπο περιεχομένου.
broader: Σύνολα δεδομένων
preferred label: Dataset @en
type: Concept

Φωτογραφική διαφάνεια
pref label in plural: Φωτογραφικές διαφάνειες
pref label in plural: Slides @en
definition: Θετικές διαφάνειες σε βάσεις κατάλληλες για προβολή, συνήθως φιλμ 35mm σε μια βάση 2 με 2 ίντσες. Μια εικόνα σε φιλμ ή γυαλί, συνήθως θετική, που προορίζεται να προβληθεί με τη βοήθεια φωτός που διέρχεται από την εικόνα και τη βάση χρησιμοποιώντας μια συσκευή προβολής ή έναν προβολέα
definition: Positive transparencies in mounts suitable for projection, usually 35mm film in a mount of 2 by 2 inches. An image on film or glass, usually positive, intended to be viewed by means of light passing through the image and base using a viewer or projector @en
broader: Φωτογραφία
preferred label: Slide @en
type: Concept

Θραύσμα
pref label in plural: Θραύσματα
pref label in plural: Fragments @en
narrower: Όστρακο
broader: Τρισδιάστατα Αντικείμενα και Έργα Τέχνης
preferred label: Fragment @en
type: Concept

Έπαθλο
pref label in plural: Έπαθλα
pref label in plural: Prizes @en
broader: Τρισδιάστατα Αντικείμενα και Έργα Τέχνης
preferred label: Prize @en
type: Concept

Δοκίμιο
pref label in plural: Δοκίμια
pref label in plural: Essays @en
definition: Short literary compositions on single subjects, often presenting the personal view of the author @en
definition: Πεζό κείμενο περιορισμένης συνήθως εκτάσεως, που πραγματεύεται συγκεκριμένο θέμα χωρίς να το εξαντλεί, εκφράζει τις προσωπικές απόψεις του γράφοντος και δεν ταυτίζεται ούτε με λογοτεχνικά κείμενα ούτε με εμπεριστατωμένες μελέτες
broader: Λογοτεχνικό έργο
preferred label: Essay @en
type: Concept

Εραλδικό μνημείο
pref label in plural: Εραλδικά μνημεία
pref label in plural: Heraldic motifs
broader: Σήμα (σύμβολο)
preferred label: Heraldic motif @en
type: Concept

Μηχάνημα
pref label in plural: Machines @en
pref label in plural: Μηχανήματα
narrower: Ηλεκτρονικός υπολογιστής
narrower: Τηλεφωνική συσκευή
broader: Εργαλεία και εξοπλισμός
preferred label: Machine @en
type: Concept

Χορευτική παράσταση
pref label in plural: Χορευτικές παραστάσεις
pref label in plural: Dance performances @en
broader: Πολιτιστική παραγωγή
preferred label: Dance performance @en
type: Concept

Επιτύμβια πλάκα
pref label in plural: Tombstones @en
pref label in plural: Επιτύμβιες πλάκες
broader: Ανάγλυφο
preferred label: Tombstone @en
type: Concept

Αρχαιολογικός χώρος
pref label in plural: Archaeological sites @en
pref label in plural: Αρχαιολογικοί χώροι
broader: Τρισδιάστατα Αντικείμενα και Έργα Τέχνης
preferred label: Archaeological site @en
type: Concept

Τυπογραφικό δοκίμιο
broader: Εκτύπωση
preferred label: Printing proof @en
type: Concept

Εξώφυλλο περιοδικού
broader: Τμήμα περιοδικού
preferred label: Journal cover @en
type: Concept

Σφραγίδα
pref label in plural: Seals @en
pref label in plural: Σφραγίδες
narrower: Σφραγιδόλιθος
broader: Τρισδιάστατα Αντικείμενα και Έργα Τέχνης
preferred label: Seal @en
type: Concept

Έργο θρησκευτικής τέχνης
pref label in plural: Έργα θρησκευτικής τέχνης
pref label in plural: Religious visual works (3D) @en
distinct pref label: Έργο θρησκευτικής τέχνης (τρισδιάστατο)
distinct pref label: Religious visual works (3D) @en
broader: Τρισδιάστατα Αντικείμενα και Έργα Τέχνης
preferred label: Religious visual works @en
type: Concept

Φάρος
pref label in plural: Φάροι
pref label in plural: Lighthouses @en
broader: Κτίριο
preferred label: Lighthouse @en
type: Concept

Γέφυρα
pref label in plural: Γέφυρες
pref label in plural: Bridges @en
broader: Κτίριο
preferred label: Bridge @en
type: Concept

Παρτιτούρες
narrower: Παρτιτούρα
preferred label: Scores @en
type: Concept

Φωτοαρνητικό
preferred label: Photonegative @en
broader: Φωτογραφία
definition: Photographs in which the tones or colors are reversed from their appearance in nature, usually on a transparent support of celluloid, acetate, or on paper, intended for the purpose of producing positive prints @en
pref label in plural: Photonegatives @en
type: Concept
alternative label: negative @en
pref label in plural: Φωτοαρνητικά
definition: Ένα κομμάτι φιλμ, ένας γυάλινος πίνακας ή χαρτί στο οποίο εμφανίζεται μία 'αρνητική' εικόνα, στην οποία οι αποχρώσεις ή τα χρώματα αντιστρέφονται από την φυσική τους εμφάνιση με σκοπό την παραγωγή θετικών εκτυπώσεων

Οικιακός εξοπλισμός
narrower: Εργόχειρο (Κεντητική, πλεκτική)
narrower: Επίπλωση
broader: Εργαλεία και εξοπλισμός
preferred label: Household accessories @en
type: Concept

Έλασμα
pref label in plural: Ελάσματα
pref label in plural: lamellae @en
broader: Τρισδιάστατα Αντικείμενα και Έργα Τέχνης
preferred label: Lamella @en
type: Concept

Τηλεφωνικός κατάλογος
pref label in plural: Telephone books @en
pref label in plural: Τηλεφωνικοί κατάλογοι
broader: Κατάλογος
preferred label: Telephone book @en
type: Concept

Επιστολή
alternative label: Αλληλογραφία
definition: A letter is one person's written message to another pertaining to some matter of common concern @en
definition: Γραπτό μήνημα που απευθύνεται σε κάποιον για θέμα κοινού ενδιαφέροντος
pref label in plural: Επιστολές
pref label in plural: Letters
alternative label: Επιστολογραφία
broader: Έγγραφο
alternative label: Correspondence @en
type: Concept
preferred label: Letter @en

Κτίριο
alternative label: Κτήριο
pref label in plural: Buildings @en
narrower: Φάρος
type: Concept
pref label in plural: Κτίρια
broader: Τρισδιάστατα Αντικείμενα και Έργα Τέχνης
narrower: Γέφυρα
narrower: Ναός
preferred label: Building @en

Τηλεκάρτα
pref label in plural: Phone cards @en
pref label in plural: Τηλεκάρτες
broader: Κάρτα
preferred label: Phone card @en
type: Concept

Παροιμία
definition: Σύντομες, συνοπτικές και επαναλαμβανόμενες δηλώσεις, που εκφράζουν μια γενική αλήθεια ή παρατήρηση σχετικά με την ζωή των ανθρώπων ή την συμπεριφορά αυτών. Συχνά ενσωματώνουν τη λαϊκή σοφία μιας ομάδας ή έθνους, ενώ διακρίνονται από τους "αφορισμούς" που είναι δηλώσεις αρχών ή εντολών, συχνά γνωστών συγγραφέων.
definition: Short, concise sayings repeated colloquially expressing a general truth or observation about human life or behavior, often embodying the folk wisdom of a group or nation. Distinguished from "aphorisms" which are statements of principle or precepts, often of known authorship. @en
broader: Άυλη πολιτιστική κληρονομιά
preferred label: Proverb @en
type: Concept

Μακέτα
pref label in plural: Scale models @en
pref label in plural: Μακέτες
distinct pref label: Μακέτα (3D)
distinct pref label: Scale model (3D) @en
broader: Μοντέλο
preferred label: Scale model @en
type: Concept

Τύποι πολιτιστικών αντικειμένων
has top concept: Πολιτιστική παραγωγή
modified: 2022-11-14T15:38:40
has top concept: Άυλη πολιτιστική κληρονομιά
has top concept: Τρισδιάστατα Αντικείμενα και Έργα Τέχνης
has top concept: Ηχογράφηση
rights: deed.el
description: To δίγλωσσο, ιεραρχικό λεξιλόγιο τύπων πολιτιστικων αντικειμένων που δημιουργησε το ΕΚΤ. Οι όροι διατηρούν συνδέσμους στο Θησαυρό για τις Τέχνες και την Αρχιτεκτονική (Art & Architecture Thesaurus) - AAT του Ιδρύματος Getty και στον σημασιολογικό θησαυρό DBpedia της Wikipedia. Το Λεξιλόγιο χρησιμοποιείται για την ταξινόμηση και ομογενοποίηση του περιεχομένου που συσσωρεύεται στην Εθνική Υποδομή Συσσώρευσης Ψηφιακού Πολιτιστικού Περιεχομένου SearchCulture.gr.
created: 2016-01-19T17:48:58
creator: National Documentation Center (EKT) @en
has top concept: Δισδιάστατα γραφικά
has top concept: Τρισδιάστατη αναπαράσταση
has top concept: Βίντεο
has top concept: Χαρτογραφικό Υλικό
format: application/ld+json
description: The vocabulary is hierarchical and bilingual and is linked to the Getty Art & Architecture Thesaurus (AAT) and the semantic thesaurus DBpedia of Wikipedia. The vocabulary is used for the homogenization and classification of the content aggregated by SearchCulture.gr, the National Aggregation Infrastructure for Cultural Heritage Content. @en
has top concept: Κείμενο
type: ConceptScheme
has top concept: Σύνολα δεδομένων
creator: Εθνικό Κέντρο Τεκμηρίωσης και Ηλεκτρονικού Περιεχομένου (ΕΚΤ)
has top concept: Παρτιτούρες
title: Cultural heritage item types @en

Τρέιλερ ταινίας/παράστασης
pref label in plural: Movie/Performance Trailers @en
pref label in plural: Τρέιλερ ταινιών/παραστάσεων
broader: Βίντεο
preferred label: Movie/Performance Trailer @en
type: Concept

Πρωτότυπο
definition: A manufactured object that serves as the working model for the production of subsequent copies. @en
preferred label: Master @en
definition: Ένα κατασκευασμένο αντικείμενο που χρησιμεύει ως μοντέλο εργασίας για την παραγωγή των επόμενων αντιγράφων (μήτρα, εκμαγείο κλπ)
distinct pref label: Πρωτότυπο (δισδιάστατο)
pref label in plural: Πρωτότυπα
type: Concept
pref label in plural: Masters @en
broader: Δισδιάστατα γραφικά
distinct pref label: Master (2D) @en

Λογοτεχνικό έργο
narrower: Διήγημα
narrower: Δοκίμιο
narrower: Απομνημονεύματα
type: Concept
narrower: Αυτοβιογραφία
narrower: Σενάριo
narrower: Ποίημα
narrower: Στίχοι τραγουδιού
narrower: Παραμύθι
definition: Tα γραπτά και προφορικά προϊόντα του έντεχνου λόγου
definition: General term for the genre of works, written or oral, that are the result or product of literary activity. @en
broader: Κείμενο
narrower: Μυθιστόρημα
narrower: Μονογραφία
preferred label: Literary work @en
narrower: Λιμπρέτο
narrower: Βιογραφία

Συνέντευξη
pref label in plural: Συνεντεύξεις
pref label in plural: Intervieww @en
distinct pref label: Συνέντευξη (μαγνητοσκόπηση)
distinct pref label: Interview (video) @en
broader: Βίντεο
preferred label: Interview @en
type: Concept

Ύφασμα
pref label in plural: Υφάσματα
pref label in plural: Textiles @en
broader: Τρισδιάστατα Αντικείμενα και Έργα Τέχνης
preferred label: Textile @en
type: Concept

Προσωπικό αντικείμενο (αξεσουάρ)
pref label in plural: Accessories @en
pref label in plural: Προσωπικά αντικείμενα (αξεσουάρ)
broader: Τρισδιάστατα Αντικείμενα και Έργα Τέχνης
preferred label: Personal accessory @en
type: Concept

Εργόχειρο (Κεντητική, πλεκτική)
pref label in plural: Εργόχειρα
pref label in plural: Needlework @en
broader: Οικιακός εξοπλισμός
preferred label: Needlework @en
type: Concept

Έντυπο υλικό
narrower: Εξώφυλλο δίσκου
preferred label: Printed material @en
narrower: Αφίσα
alternative label: Printout @en
definition: Είδος γραπτού έργου που δημοσιεύεται ή εναλαλκτικά διατίθεται σε έντυπη μορφή, συνήθως σε χαρτί.
type: Concept
narrower: Απόκομμα
narrower: Φυλλάδιο
narrower: Πρόγραμμα
broader: Εκτύπωση
definition: Genre of written works published or otherwise available in printed form, usually on paper. @en
narrower: Αυτοκόλλητη ετικέτα

Πολιτιστική Εκδήλωση
pref label in plural: Cultural events @en
pref label in plural: Πολιτιστικές Εκδηλώσεις
definition: Δραστηριότητες, είτε παραδοσιακές είτε τελετουργικές που σχετίζονται με μια συγκεκριμένη κουλτούρα.
broader: Πολιτιστική παραγωγή
preferred label: Cultural event @en
type: Concept

Animation ταινία
broader: Βίντεο
preferred label: Animation film @en
type: Concept

Φορητή Εικόνα
definition: Ιmages that portray a sacred entity (Christian) produced for devotional use in the church or home. @en
preferred label: Icon @en
pref label in plural: Φορητές εικόνες
definition: Εικόνες που απεικονίζουν μια ιερή οντότητα (Χριστιανική). Παράγονται για ιδιωτική και δημόσια λατρευτική χρήση.
pref label in plural: Icons @en
alternative label: Αγιογραφία
type: Concept
broader: Έργο θρησκευτικής τέχνης

Λαϊκή Παράδοση
pref label in plural: Folk Legends @en
pref label in plural: Λαϊκές Παραδόσεις
broader: Άυλη πολιτιστική κληρονομιά
pref label in plural: Folk Traditions @en
alternative label: Folk Tradition @en
type: Concept
definition: Ιστορίες προερχόμενες από την παράδοση παλαιότερων εποχών, που συνήθως αφορούσαν ένα πραγματικό πρόσωπο, τόπο ή γεγονός. Επί το πλείστον αντιμετωπίζονταν ως ιστορικά τεκμήρια, τα οποία ωστόσο δεν ήταν πλήρως επαληθεύσιμα.
preferred label: Folk Legend @en
definition: Stories handed down by tradition from earlier times, usually concerned with a real person, place, or event, and popularly regarded as historical although not entirely verifiable. @en

Περιοδικό
pref label in plural: Periodicals @en
pref label in plural: Περιοδικά
definition: Δημοσιεύσεις που εκδίδονται σε τακτά χρονικά διαστήματα - αλλά όχι καθημερινά και που στοχεύουν στην πληροφόρηση ή ψυχαγωγία του ευρύτερου αναγνωστικού κοινού. Περιέχουν άρθρα διαφορετικών συγγραφέων πάνω σε διάφορα θέματα, ενώ διακρίνονται σε κατηγορίες ανάλογα με την κυκλοφορία τους (εβδομαδιαία, μηνιαία κλπ.) και τη θεματολογία τους (Περιοδικά Ποικίλης Ύλης, Οικονομικά Περιοδικά, Περιοδικά Ιστορίας, Περιοδικά Μόδας, Περιοδικά υγείας, Αθλητικά Περιοδικά, κ.ά.) Επίσης, πέραν των παραδοσιακών έντυπων περιοδικών υπάρχουν και τα ηλεκτρονικά Περιοδικά, που δραστηριοποιούνται στο διαδίκτυο.
definition: Publications issued at regular intervals, but not daily, containing articles on various subjects by different authors for the general reader. @en
broader: Περιοδική έκδοση
preferred label: Periodical @en
type: Concept

Ηχογράφηση θεατρικής παράστασης
pref label in plural: Theater play recordings @en
pref label in plural: Ηχογραφήσεις θεατρικής παράστασης
broader: Ηχογράφηση παράστασης
preferred label: Theater play recording @en
type: Concept

Απόκομμα
distinct pref label: Clipping (2D) @en
definition: Illustrations, pages, articles, or columns of text removed from books, newspapers, journals, or other printed sources and kept for their informational content. @en
definition: Εικονογραφήσεις, σελίδες, άρθρα ή στήλες κειμένου που έχουν αποκοπεί από βιβλία, εφημερίδες, περιοδικά ή άλλες έντυπες πηγές και διατηρούνται για το πληροφοριακό τους περιεχόμενο.
type: Concept
broader: Έντυπο υλικό
pref label in plural: Clippings @en
distinct pref label: Απόκομμα (δισδιάστατο)
pref label in plural: Αποκόμματα
preferred label: Clipping @en

Λιμπρέτο
broader: Λογοτεχνικό έργο
preferred label: Libretto @en
type: Concept

Μονογραφία
pref label in plural: Monographs @en
definition: Separate treatises on a particular subject, typically written expositions of a subject narrow enough in scope to exclude all but a single aspect of the subject, for example, a study of the works of a single artist @en
broader: Λογοτεχνικό έργο
pref label in plural: Μονογραφίες
type: Concept
definition: Πραγματεία για ένα συγκεκριμένο θέμα, αρκετά στενή ώστε να αποκλειστούν όλες οι πτυχές του εκτός από μία, για παράδειγμα, μια μελέτη των έργων ενός μόνο καλλιτέχνη
preferred label: Monograph @en

Φωτογραφία
pref label in plural: Photos @en
pref label in plural: Photographs @en
preferred label: Photo @en
broader: Δισδιάστατα γραφικά
narrower: Φωτογραφική διαφάνεια
definition: Still images produced from radiation-sensitive materials (sensitive to light, electron beams, or nuclear radiation), generally by means of the chemical action of light on a sensitive film, paper, glass, or metal. Photographs may be positive or negative, opaque or transparent. @en
narrower: Φωτοαρνητικό
type: Concept
narrower: Στιγμιότυπο βίντεο
pref label in plural: Φωτογραφίες
definition: Ακίνητες εικόνες που παράγονται από ευαίσθητα στην ακτινοβολία υλικά (ευαίσθητα στο φως, δέσμες ηλεκτρονίων ή πυρηνική ακτινοβολία), γενικά μέσω της χημικής δράσης του φωτός σε ευαίσθητο φιλμ, χαρτί, γυαλί ή μέταλλο. Οι φωτογραφίες μπορεί να είναι θετικές ή αρνητικές, αδιαφανείς ή διαφανείς

Τοιχογραφία
pref label in plural: Murals @en
pref label in plural: Τοιχογραφίες
definition: Ζωγραφικές αναπαραστάσεις που κυριαρχούν σε επιφάνεια τοίχου (ή οροφής).
definition: Painted decorations or scenes that dominate a wall (or ceiling) surface. @en
broader: Έργο ζωγραφικής
preferred label: Murals @en
type: Concept