Ερωτηματολόγιο
definition: Documents containing a set of questions for submission to a number of persons in order to obtain statistically useful information. source: http://vocab.getty.edu/page/aat/300027265 @en
definition: Έγγραφα με ερωτήσεις που υποβάλλονται σε έναν αριθμό ατόμων προκειμένου να ληφθούν στατιστικές πληροφορίες.
broader: Έργο αναφοράς
preferred label: Questionnaire @en
type: Concept

Διαδραστικός πόρος
definition: Ένας πόρος που απαιτεί αλληλεπίδραση από το χρήστη για να γίνει κατανοητός, να εκτελεστεί ή να βιωθεί. Παραδείγματα περιλαμβάνουν φόρμες σε ιστοσελίδες, μικροεφαρμογές, αντικείμενα εκμάθησης πολυμέσων, περιβάλλοντα εικονικής πραγματικότητας.
preferred label: Interactive resource @en
type: Concept

Εικόνα (μη κινούμενη)
narrower: Φωτογραφία
narrower: Αφίσα
narrower: Γράφημα/διάγραμμα
narrower: Εκτύπωση
narrower: Ευχετήρια κάρτα
preferred label: Image (still) @en
type: Concept

Δίπλωμα ευρεσιτεχνίας
definition: Έγγραφο που παρέχει αποκλειστικά δικαιώματα στον εφευρέτη ή στον δικαιούχο μιας εφεύρεσης. Πρόκειται για τίτλο προστασίας.
alternative label: Πατέντα
preferred label: Patent @en
type: Concept

Δελτίο τύπου
broader: Έγγραφο (δηλωτικό)
preferred label: Press release @en
type: Concept

Ελεγχόμενο λεξιλόγιο
broader: Έργο αναφοράς
preferred label: Controlled vocabulary @en
type: Concept

Έκθεση
definition: Έκθεση που παρουσιάζει τα ευρήματα μιας έρευνας (με παρουσιάσεις στοιχείων, διαδικασιών ή γεγονότων). Επίσης, η έκθεση δραστηριοτήτων ενός συλλογικού οργάνου. Γενικά, ο όρος Έκθεση/Αναφορά αφορά μια επίσημη αναφορά πληροφοριών που σχετίζεται με ένα συγκεκριμένο γεγονός ή φαινόμενο. Ενδέχεται να εκδίδεται σε τακτά χρονικά διαστήματα.
type: Concept
narrower: Παραδοτέο έργου
narrower: Στατιστική έκθεση
narrower: Τεχνική έκθεση
narrower: Ερευνητική έκθεση
narrower: Έκθεση δραστηριοτήτων (Ετήσια έκθεση)
narrower: Έκθεση για χρηματοδότηση
narrower: Έκθεση πολιτικής (στρατηγική)
narrower: Ετήσιο Στατιστικό Πρόγραμμα
preferred label: Report @en

Δημογραφική έρευνα
related match: gf2014026059
definition: Αναφορές σχετικά με την υγεία, με κοινωνικά, οικονομικά ή άλλα χαρακτηριστικά ενός πληθυσμού που βασίζονται γενικά σε εκτιμήσεις και υπολογίζονται με δειγματοληψία.
broader: Έργο αναφοράς
preferred label: Demographic survey @en
type: Concept

Ηλεκτρονικό σύστημα ή υπηρεσία πληροφόρησης
related match: ons
narrower: Ψηφιακό αποθετήριο
narrower: Ψηφιακός χάρτης
narrower: Συσσωρευτής περιεχομένου
narrower: Υποδομή περιεχομένου
narrower: Διαδικτυακή εφαρμογή
preferred label: Online system or information service @en
type: Concept

Κατάλογος
narrower: Κατάλογος βιβλιοθήκης
broader: Έργο αναφοράς
narrower: Ενιαίος κατάλογος
definition: Enumerations of items, such as a file of bibliographic records or a list of art objects, usually arranged systematically and with descriptive details; may be in book or pamphlet form, on cards, or online. πηγή: http://vocab.getty.edu/page/aat/300026059 @en
preferred label: Catalogue @en
type: Concept
narrower: Κατάλογος επιστημονικών εκδόσεων
definition: Λίστα αντικειμένων συνήθως διατεταγμένα συστηματικά και με περιγραφικές λεπτομέρειες π.χ. αρχείο βιβλιογραφικών εγγραφών, λίστα μουσειακών αντικειμένων. Μπορεί να είναι σε μορφή βιβλίου, φυλλαδίου, σε ηλεκτρονική ή άλλη μορφή.
narrower: Κατάλογος περιοδικών με ανοιχτή πρόσβαση

Φωτογραφία
broader: Εικόνα (μη κινούμενη)
preferred label: Photograph @en
type: Concept

Έκθεση πολιτικής (στρατηγική)
broader: Έκθεση
preferred label: Policy report @en
type: Concept

Υποδομή περιεχομένου
broader: Ηλεκτρονικό σύστημα ή υπηρεσία πληροφόρησης
preferred label: Content infrastruture @en
type: Concept

Ηχογράφηση
preferred label: Sound recording @en
type: Concept

Συζητήσεις στρογγυλής τραπέζης
definition: Assemblies of people with a common interest for conferences or discussions at which all participants are accorded equal status. (getty:http://vocab.getty.edu/page/aat/300404084) @en
broader: Εκδήλωση
preferred label: Roundtables @en
type: Concept

Προωθητικό βίντεο
preferred label: Promotional video @en
type: Concept

Γεωγραφική βάση δεδομένων
broader: Βάση δεδομένων
alternative label: Geographic database @en
alternative label: GIS database @en
alternative label: GDB
preferred label: Geodatabase @en
type: Concept

Τύποι Αποθετηρίου ΕΚΤ
has top concept: Επιστολή
has top concept: Preprint
has top concept: Έργο αναφοράς
has top concept: Έγγραφο (δηλωτικό)
has top concept: Περιοδική έκδοση
has top concept: Ηλεκτρονικό σύστημα ή υπηρεσία πληροφόρησης
has top concept: Δίπλωμα ευρεσιτεχνίας
has top concept: Νομοθέτημα
has top concept: Αντικείμενο συνεδρίου
creator: Εθνικό Κέντρο Τεκμηρίωσης και Ηλεκτρονικού Περιεχομένου (ΕΚΤ)
has top concept: Αφιέρωμα
has top concept: Δικτυακή πύλη
has top concept: Σύνολο δεδομένων
creator: National Documentation Center (EKT) @en
has top concept: Γεωχωρικά δεδομένα
has top concept: Συνέντευξη
created: 2020-04-28T13:09:06
has top concept: Κριτική
has top concept: Μελέτη
has top concept: Απόκομμα
contributor: Μπάρτζη, Κατερίνα
has top concept: Διατριβή
has top concept: Ημερολόγιο
has top concept: Επιχειρηματικό σχέδιο
has top concept: Διαδραστικός πόρος
has top concept: Στοιχεία απογραφής
has top concept: Ιστότοπος
has top concept: Χρονολόγιο
has top concept: Κείμενο εργασίας
format: application/ld+json
has top concept: Εγχειρίδιο/Οδηγός
has top concept: Βάση δεδομένων
has top concept: Φυλλάδιο
title: EKT Repository Types @en
has top concept: Εικόνα (μη κινούμενη)
has top concept: Προωθητικό βίντεο
description: Οι «Τύποι Αποθετηρίου ΕΚΤ» είναι ένα δίγλωσσο, ιεραρχικό λεξιλόγιο που αναπτύχθηκε από το ΕΚΤ στο πλαίσιο ανάπτυξης του ιδρυματικού του αποθετηρίου «Αριάδνη». Το λεξιλόγιο ορίζει όρους που προσδιορίζουν το είδος περιεχομένου επιστημονικών και ερευνητικών πόρων. Οι όροι τεκμηριώνονται με ορισμούς, εναλλακτικές ονομασίες, σχέσεις ιεραρχίας με στενότερους και ευρύτερους όρους και συνδέσεις αντιστοιχίσεων με τύπους πόρων άλλων ανοιχτών λεξιλογίων, όπως το Resource Type vocabulary του COAR, τον θησαυρό Art & Architecture Thesaurus του ιδρύματος Getty, το LC Genre/Form Terms (LCGFT) της Βιβλιοθήκης του Κογκρέσου.
rights: deed.el
type: ConceptScheme
has top concept: Λογισμικό
has top concept: Έκθεση
has top concept: Βιβλίο
modified: 2022-11-14T15:38:40
has top concept: Ηχογράφηση
has top concept: Εκδήλωση
has top concept: Ομιλία
has top concept: Άρθρο
has top concept: Στατιστικός χάρτης
has top concept: Έργο για διδασκαλία/εκπαίδευση

Συμπόσιο
definition: Επιστημονική συνάντηση ειδικών πάνω σε ένα θέμα.
broader: Συνέδριο
preferred label: Symposium @en
type: Concept

Διαδικτυακό σεμινάριο
broader: Εκπαιδευτική εκδήλωση
broader: Έργο για διδασκαλία/εκπαίδευση
preferred label: Webinar @en
type: Concept

Επιστημονικό περιοδικό
broader: Περιοδική έκδοση
preferred label: Journal @en
type: Concept

Ενημερωτικό δελτίο
broader: Περιοδική έκδοση
preferred label: Newsletter @en
type: Concept

Μελέτη
definition: Recorded results of diligent and systematic inquiry or investigation into a subject made to discover or revise facts, theories, or applications. (source: http://www.getty.edu/vow/AATFullDisplay?find=&logic=AND&note=&subjectid=300254807)) @en
preferred label: Research @en
type: Concept

Υβριδική εκδήλωση
definition: Μια υβριδικη εκδήλωση είναι ένας συνδυασμός μιας ζωντανής εκδήλωσης με εικονικά διαδικτυακά στοιχεία. Θα μπορούσε να είναι οποιοδήποτε είδος εκδήλωσης, όπως ένα συνέδριο, ένα σεμινάριο, ένα εργαστήριο. Τα οφέλη των υβριδικών εκδηλώσεων είναι ότι αυξάνει ο αριθμός των συμμετεχόντων με χαμηλό σχετικά κόστος.
broader: Εκδήλωση
preferred label: Hybrid event @en
type: Concept

Ερευνητικό άρθρο
broader: Άρθρο σε επιστημονικό περιοδικό
preferred label: Research article @en
type: Concept

Λογισμικό έρευνας
broader: Λογισμικό
preferred label: Research software @en
type: Concept

Συνάντηση εργασίας
broader: Εκδήλωση
preferred label: Working meeting @en
type: Concept

Χρονολόγιο
preferred label: Timeline @en
type: Concept

Βιβλιογραφία
broader: Έργο αναφοράς
preferred label: Bibliography @en
type: Concept

Στατιστικός χάρτης
preferred label: Statistical map @en
type: Concept

Ανακοίνωση σε συνέδριο
broader: Αντικείμενο συνεδρίου
preferred label: Conference paper @en
type: Concept

Περιοδική έκδοση
narrower: Εφημερίδα
narrower: Επετηρίδα
narrower: Επιστημονικό περιοδικό
narrower: Περιοδικό
narrower: Ενημερωτικό δελτίο
preferred label: Serial publication @en
type: Concept

Σύνολο δεδομένων
definition: Συλλογές παρόμοιων ή σχετικών δεδομένων που συνήθως συγκεντρώνονται για έρευνα. Για ηλεκτρονικά συστήματα που επιτρέπουν την εύκολη πρόσβαση, χειρισμό και ενημέρωση δεδομένων χρησιμοποιείτε τον όρο "Βάση δεδομένων". (πηγή: http://id.loc.gov/authorities/genreForms/gf2018026119.html))
definition: Collections of similar or related data that are usually assembled as a matter of record or for research. For electronic systems that allow data to be easily accessed, manipulated, and updated see Databases. (source: http://id.loc.gov/authorities/genreForms/gf2018026119))
preferred label: Dataset @en
type: Concept

Δικτυακή πύλη
preferred label: Web portal @en
type: Concept

Αντικείμενο συνεδρίου
narrower: Περίληψη σε συνέδριο
narrower: Ανακοίνωση σε συνέδριο
narrower: Αναρτημένη ανακοίνωση
narrower: Πρακτικά συνεδρίου
preferred label: Conference object @en
type: Concept

Άρθρο ανασκόπησης
broader: Άρθρο σε επιστημονικό περιοδικό
preferred label: Review article @en
type: Concept

Νομοθέτημα
preferred label: Legislation @en
type: Concept

Ερευνητική έκθεση
definition: Περιγράφει τα αποτελέσματα ενός ερευνητικού έργου ή παρέχει μιας εις βάθος μελέτη ενός επιστημονικού ζητήματος (επιστημονικές παρατηρήσεις πάνω σε ένα ζήτημα).
broader: Έκθεση
preferred label: Research report @en
type: Concept

Εορταστική εκδήλωση
narrower: Επετειακή εκδήλωση
broader: Πολιτιστική εκδήλωση
preferred label: Celebration @en
type: Concept

Στατιστική έκθεση
broader: Έκθεση
preferred label: Statistical report @en
type: Concept

Κατάλογος βιβλιοθήκης
definition: Δομημένη περιγραφή του περιεχομένου βιβλιοθήκης. Μπορεί να είναι σε οποιαδήποτε μορφή.
broader: Κατάλογος
preferred label: Library catalogue @en
type: Concept

Ανακοίνωση
definition: Ενημερώσεις για ένα συμβάν ή άλλα νέα. Μπορεί να είναι έντυπες ή προφορικές.
broader: Έγγραφο (δηλωτικό)
preferred label: Announcement @en
type: Concept

Ιστότοπος
alternative label: Δικτυακός τόπος
preferred label: Website @en
type: Concept

Επιστολή
preferred label: Letter @en
type: Concept

Στοιχεία απογραφής
related match: gf2014026207
related match: gf2017026102
definition: Official counts of the population of a place or ethnic group that sometimes include data relating to economic and social conditions. For reports about the social, economic, health, or other characteristics of a population that are generally based on estimates calculated through sampling techniques see [Demographic surveys.] For official public records of births, deaths, marriages, divorces, and other life events see [Vital statistics.] Source: http://id.loc.gov/authorities/genreForms/gf2014026059.html @en
preferred label: Census data @en
type: Concept

Εκτύπωση
definition: Εικόνες που σχηματίζονται με αναπαραγωγή από τη μία επιφάνεια ή πηγή στην άλλη. Συνήθως δημιουργούνται με μελάνι.
broader: Εικόνα (μη κινούμενη)
preferred label: Print @en
type: Concept

Άρθρο σε εφημερίδα
broader: Άρθρο
preferred label: Newspaper article @en
type: Concept

Φυλλάδιο
definition: Έντυπο που αποτελείται από ένα φύλλο χαρτιού και προορίζεται κυρίως για δωρεάν διανομή.
preferred label: Leaflet @en
type: Concept

Έκθεση για χρηματοδότηση
broader: Έκθεση
preferred label: Report to funding agency @en
type: Concept

Πτυχιακή εργασία
broader: Διατριβή
preferred label: Bachelor thesis @en
type: Concept

Περίληψη σε συνέδριο
broader: Αντικείμενο συνεδρίου
preferred label: Conference abstract @en
type: Concept

Επετηρίδα
broader: Περιοδική έκδοση
broader: Έργο αναφοράς
alternative label: Yearbook @en
preferred label: Annual @en
type: Concept

Μέρος βιβλίου
definition: A defined chapter or section of a book, usually with a separate title or number. http://www.ukoln.ac.uk/repositories/digirep/index/Eprints_Type_Vocabulary_Encoding_Scheme#Book @en
broader: Βιβλίο
preferred label: Book part @en
type: Concept

Εφημερίδα
broader: Περιοδική έκδοση
preferred label: Newspaper @en
type: Concept

Πολιτιστική εκδήλωση
narrower: Εορταστική εκδήλωση
broader: Εκδήλωση
preferred label: Cultural event @en
type: Concept

Διάλεξη
broader: Έργο για διδασκαλία/εκπαίδευση
preferred label: Lecture @en
type: Concept

Ψηφιακός χάρτης
broader: Ηλεκτρονικό σύστημα ή υπηρεσία πληροφόρησης
preferred label: Digital map @en
type: Concept

Ευρετήριο
broader: Έργο αναφοράς
preferred label: Index @en
type: Concept

Ντοκιμαντέρ
broader: Έργο για διδασκαλία/εκπαίδευση
preferred label: Documentary @en
type: Concept

Γράφημα/διάγραμμα
broader: Εικόνα (μη κινούμενη)
preferred label: Graph/chart @en
type: Concept

Ανάρτηση
broader: Έγγραφο (δηλωτικό)
preferred label: Blog post @en
type: Concept

Ετήσιο Στατιστικό Πρόγραμμα
broader: Έκθεση
preferred label: Annual Statistical Program @en
type: Concept

Άρθρο σε επιστημονικό περιοδικό
narrower: Ερευνητικό άρθρο
narrower: Δημοσίευση δεδομένων
narrower: Άρθρο ανασκόπησης
broader: Άρθρο
preferred label: Scientific journal article @en
type: Concept

Συζητήσεις (συνεδριάσεων)
broader: Εκδήλωση
preferred label: Discussions (meetings) @en
type: Concept

Έργο για διδασκαλία/εκπαίδευση
narrower: Μαθησιακό αντικείμενο
narrower: Εργαστήριο
narrower: Σεμινάριο
definition: Έργα που έχουν ως σκοπό να μεταφέρουν γνώσεις ή και δεξιότητες.
preferred label: Instructional/educational work @en
type: Concept
narrower: Διάλεξη
narrower: Ντοκιμαντέρ
narrower: Διαδικτυακό σεμινάριο
narrower: Φροντιστηριακό υλικό

Μεταπτυχιακή εργασία
broader: Διατριβή
preferred label: Master thesis @en
type: Concept

Βιβλιοκρισία
broader: Κριτική
preferred label: Book review @en
type: Concept

Παρουσίαση
related match: sh99004360
definition: Spoken or visual representations of information, such as speeches, demonstrations, and slide shows, for the purpose of achieving favorable visibility and persuading an audience to believe or support the presentor's ideas, projects, or goals. (http://vocab.getty.edu/page/aat/300258677)
broader: Εκδήλωση
preferred label: Presentation @en
type: Concept

Βιβλίο
definition: A non-serial publication that is complete in one volume or a designated finite number of volumes. In physical form, a book is a collection of sheets of paper, parchment or other material bound together along one edge within covers. Books are often identified with an ISBN. http://www.ukoln.ac.uk/repositories/digirep/index/Eprints_Type_Vocabulary_Encoding_Scheme#Book
narrower: Μέρος βιβλίου
type: Concept

Απόφαση
definition: Διατάγματα ή αποφάσεις που εκδίδονται από μια αρχή για τη διευθέτηση ενός ζητήματος.
broader: Έγγραφο (δηλωτικό)
preferred label: Decree @en
type: Concept

Preprint
definition: Προσχέδιο άρθρου, πριν από την αξιολόγηση από ομοτίμους, ακόμη και πριν από επαφή με έναν εκδότη.
type: Concept

Άρθρο
definition: Composition prepared for publication as an independent portion of a magazine, newspaper, encyclopedia, or other work. (source: MARC http://id.loc.gov/vocabulary/marcgt/art)
narrower: Άρθρο σε επιστημονικό περιοδικό
narrower: Άρθρο σε περιοδικό
narrower: Άρθρο σε εφημερίδα
preferred label: Article @en
type: Concept

Διατριβή
narrower: Πτυχιακή εργασία
narrower: Διδακτορική διατριβή
narrower: Μεταπτυχιακή εργασία
preferred label: Thesis @en
type: Concept

Έκθεση δραστηριοτήτων (Ετήσια έκθεση)
broader: Έκθεση
preferred label: Annual report @en
type: Concept

Γλωσσάριο
definition: Αλφαβητική λίστα όρων που σχετίζονται με ένα συγκεκριμένο θέμα ή περιοχή ενδιαφέροντος, συμπεριλαμβανομένων ορισμών ή επεξηγήσεων χρήσης. (πηγή: http://vocab.getty.edu/page/aat/300026189) )
broader: Έργο αναφοράς
preferred label: Glossary @en
type: Concept

Κατάλογος περιοδικών με ανοιχτή πρόσβαση
broader: Κατάλογος
preferred label: Open Access Journals catalogue @en
type: Concept

Εργαστήριο
definition: Σεμινάρια υπό τη μορφή εργαστηρίων.
broader: Εκπαιδευτική εκδήλωση
broader: Έργο για διδασκαλία/εκπαίδευση
preferred label: Workshop @en
type: Concept

Συνέδριο
definition: Συναντήσεις μεταξύ ατόμων για τη συζήτηση θεμάτων κοινού ενδιαφέροντος και την επίσημη ή δημόσια ανταλλαγή απόψεων.
narrower: Συμπόσιο
broader: Εκδήλωση
preferred label: Conference @en
type: Concept

Αναρτημένη ανακοίνωση
broader: Αντικείμενο συνεδρίου
alternative label: Poster συνεδρίου
preferred label: Confererence poster @en
type: Concept

Σεμινάριο
definition: Use generally for conferences or courses of instruction for specialists. Use in an academic context for meetings of small groups of advanced students studying a subject in depth under a professor, each student doing some original research, and all exchanging results. (source:http://vocab.getty.edu/page/aat/300069755) @en
broader: Εκπαιδευτική εκδήλωση
broader: Έργο για διδασκαλία/εκπαίδευση
preferred label: Seminar @en
type: Concept

Εκδήλωση
narrower: Συνέδριο
narrower: Συζητήσεις (συνεδριάσεων)
narrower: Συζητήσεις στρογγυλής τραπέζης
narrower: Διαδικτυακή ημερίδα
narrower: Υβριδική εκδήλωση
narrower: Πολιτιστική εκδήλωση
narrower: Συνάντηση εργασίας
preferred label: Event @en
narrower: Εκπαιδευτική εκδήλωση
narrower: Παρουσίαση
type: Concept
narrower: Ημερίδα

Γεωχωρικά δεδομένα
preferred label: Geospatial data @en
type: Concept

Προδιαγραφές
definition: Βέλτιστες πρακτικές σχετικά με μια διαδικασία, μια δραστηριότητα ή ένα θέμα.
broader: Έργο αναφοράς
alternative label: Κατευθυντήριες γραμμές
preferred label: Guidelines @en
type: Concept

Ζωτικά στατιστικά
definition: Official public records of births, deaths, marriages, divorces, and other life events. @en
definition: Επίσημα δημόσια δεδομένα γεννήσεων, θανάτων, γάμων, διαζυγίων και άλλων γεγονότων που έχουν σχέση με τη ζωή.
broader: Στατιστικές και δείκτες
preferred label: Vital statistics @en
type: Concept

Βιβλιογραφική βάση δεδομένων
broader: Βάση δεδομένων
preferred label: bibliographic databases @en
type: Concept

Αφιέρωμα
preferred label: Special @en
type: Concept

Ενιαίος κατάλογος
broader: Κατάλογος
alternative label: Συλλογικός κατάλογος
preferred label: Union catalogue @en
type: Concept

Άρθρο σε περιοδικό
broader: Άρθρο
preferred label: Magazine article @en
type: Concept

Δημοσίευση δεδομένων
definition: A scholarly publication describing a particular dataset or group of dataset, published in the form of a peer-reviewed article in a scholarly journal. source: https://en.wikipedia.org/wiki/Data_publishing#Paper @en
definition: Επιστημονική δημοσίευση για ένα σύνολο δεδομένων ή μια ομάδα συνόλων δεδομένων. Δημοσιεύεται με peer-review μορφή σε επιστημονικό περιοδικό.
broader: Άρθρο σε επιστημονικό περιοδικό
preferred label: Data paper @en
type: Concept

Περιοδικό
broader: Περιοδική έκδοση
preferred label: Magazine @en
type: Concept

Έργο αναφοράς
narrower: Βιβλιογραφία
narrower: Προδιαγραφές
narrower: Πίνακας (με δεδομένα)
definition: Έργα που δεν έχουν ως κύριο σκοπό την ανάγνωση, αλλά την γρήγορη ανάκτηση πληροφοριών. Τέτοιου είδους έργα είναι οι εγκυκλοπαίδειες, τα λεξικά, οι θησαυροί, οι κατάλογοι βιβλιοθηκών κ.λπ. σε ηλεκτρονική ή έντυπη μορφή.
narrower: Ερωτηματολόγιο
narrower: Στατιστικές και δείκτες
narrower: Ευρετήριο
narrower: Ελεγχόμενο λεξιλόγιο
narrower: Κατάλογος
narrower: Γλωσσάριο
type: Concept
preferred label: Reference work @en
narrower: Επετηρίδα
definition: A work to which one can refer for information. The information is intended to be found quickly when needed. Reference works are usually referred to for particular pieces of information, rather than read beginning to end. Reference works include dictionaries, encyclopedias, almanacs, atlases, bibliographies, biographical sources, catalogs such as library catalogs etc. (source: https://en.wikipedia.org/wiki/Reference_work)
narrower: Δημογραφική έρευνα

Έγγραφο (δηλωτικό)
definition: Έγγραφο που δηλώνει, καθορίζει ή επεξηγεί κάτι, όπως τις προθέσεις ή τις αποφάσεις ενός προσώπου (φυσικού ή συλλογικού), διάφορα γεγονότα, νόμους κ.λπ.
narrower: Απόφαση
narrower: Ανακοίνωση
narrower: Δελτίο τύπου
narrower: Ανάρτηση
preferred label: Declaratory document @en
type: Concept

Διαδικτυακή ημερίδα
broader: Εκδήλωση
preferred label: e-info day @en
type: Concept

Διαδικτυακή εφαρμογή
broader: Ηλεκτρονικό σύστημα ή υπηρεσία πληροφόρησης
preferred label: Web application @en
type: Concept

Βάση δεδομένων
definition: Electronic system that allow data to be easily accessed, manipulated, and updated. For collections of similar or related data that are usually assembled as a matter of record or for research see Data set. (source: http://id.loc.gov/authorities/genreForms/gf2014026081) @en
definition: Ηλεκτρονικό σύστημα που επιτρέπει την εύκολη πρόσβαση, χειρισμό και ενημέρωση των δεδομένων. Για συλλογές παρόμοιων ή σχετικών δεδομένων για έρευνα, χρησιμοποιείτε Σύνολο δεδομένων. (πηγή: http://id.loc.gov/authorities/genreForms/gf2014026081)
narrower: Γεωγραφική βάση δεδομένων
narrower: Βιβλιογραφική βάση δεδομένων
preferred label: Database @en
type: Concept

Κείμενο εργασίας
preferred label: Working paper @en
type: Concept

Πίνακας (με δεδομένα)
definition: Δεδομένα σε μορφή κειμένου τα οποία είναι διατεταγμένα σε στήλες και σειρές. Για γραφικές αναπαρασράσεις χρησιμοποιείτε τον τύπο "Γράφημα".
broader: Έργο αναφοράς
preferred label: Table (Data) @en
type: Concept

Συνέντευξη
preferred label: Interview @en
type: Concept

Ιατρική στατιστική
broader: Στατιστικές και δείκτες
preferred label: Medical statistics @en
type: Concept

Ημερολόγιο
preferred label: Calendar @en
type: Concept

Κριτική
definition: Κριτική ενός δημοσιευμένου έργου άλλου.
narrower: Βιβλιοκρισία
preferred label: Review @en
type: Concept

Ψηφιακό αποθετήριο
broader: Ηλεκτρονικό σύστημα ή υπηρεσία πληροφόρησης
preferred label: Digital repository @en
type: Concept

Παραδοτέο έργου
broader: Έκθεση
preferred label: Project deliverable @en
type: Concept

Ημερολόγιο
alternative label: Σημειωματάριο
preferred label: Diary @en
type: Concept

Ευχετήρια κάρτα
broader: Εικόνα (μη κινούμενη)
preferred label: Greetings card @en
type: Concept

Φροντιστηριακό υλικό
broader: Έργο για διδασκαλία/εκπαίδευση
preferred label: Tutorial @en
type: Concept

Βιοστατιστικά
broader: Στατιστικές και δείκτες
preferred label: Biostatistics @en
type: Concept

Απόκομμα
definition: Εικονογραφήσεις, σελίδες, άρθρα ή στήλες κειμένου που έχουν αφαιρεθεί από βιβλία, εφημερίδες, περιοδικά ή άλλες έντυπες πηγές και διατηρούνται για το ενημερωτικό τους περιεχόμενο.
definition: Illustrations, pages, articles, or columns of text removed from books, newspapers, journals, or other printed sources and kept for their informational content. source: http://vocab.getty.edu/page/aat/300026867 @en
preferred label: Clipping @en
type: Concept

Διδακτορική διατριβή
broader: Διατριβή
preferred label: Doctoral thesis @en
type: Concept

Ομιλία
preferred label: Speech @en
type: Concept

Επιχειρηματικό σχέδιο
preferred label: Project/Business plan @en
type: Concept

Τεχνική έκθεση
definition: Έκθεση που καταγράφει στοιχεία και αποτελέσματα μιας συγκεκριμένης έρευνας ενός τεχνικού ή επιστημονικού ζητήματος. Περιγράφει στοιχεία της έρευνας όπως, την μεθοδολογία, τις δοκιμές και αξιολογήσεις, τα συμπεράσματα. Η Τεχνική έκθεση καλύπτει τεχνικές πτυχές ενός ζητήματος και απευθύνεται σε κοινότητα τεχνικών (σε σχέση με την γενική «Έκθεση/Αναφορά» που συντάσσεται με τρόπο που να είναι κατανοητή από μια ευρύτερη κοινότητα).
broader: Έκθεση
preferred label: Technical report @en
type: Concept

Επετειακή εκδήλωση
broader: Εορταστική εκδήλωση
preferred label: Anniversarie @en
type: Concept

Κατάλογος επιστημονικών εκδόσεων
broader: Κατάλογος
preferred label: Catalogue of scientific publications @en
type: Concept

Εγχειρίδιο/Οδηγός
preferred label: Manual/Guide @en
type: Concept

Εκπαιδευτική εκδήλωση
definition: Εκδηλώσεις που έχουν ως σκοπό την κατάρτιση και εκπαίδευση ανθρώπων.
narrower: Διαδικτυακό σεμινάριο
narrower: Εργαστήριο
narrower: Σεμινάριο
broader: Εκδήλωση
preferred label: Educational event @en
type: Concept

Μαθησιακό αντικείμενο
definition: Υλικό που έχει ως στόχο να μεταδώσει γνώσεις, δεξιότητες, στάσεις.
broader: Έργο για διδασκαλία/εκπαίδευση
preferred label: Learning object @en
type: Concept

Συσσωρευτής περιεχομένου
broader: Ηλεκτρονικό σύστημα ή υπηρεσία πληροφόρησης
preferred label: Content aggregator @en
type: Concept

Στατιστικές και δείκτες
narrower: Ιατρική στατιστική
narrower: Βιοστατιστικά
narrower: Ζωτικά στατιστικά
broader: Έργο αναφοράς
preferred label: Statistics @en
type: Concept

Πρακτικά συνεδρίου
narrower: Κεφάλαιο σε πρακτικά συνεδρίου
broader: Αντικείμενο συνεδρίου
preferred label: Conference proceedings @en
type: Concept

Κεφάλαιο σε πρακτικά συνεδρίου
broader: Πρακτικά συνεδρίου
preferred label: Conference proceeding chapter @en
type: Concept

Λογισμικό
narrower: Λογισμικό έρευνας
preferred label: Software @en
type: Concept

Αφίσα
definition: Εικονογραφημένα έργα που αναρτούνται για να διαφημίσουν, να προωθήσουν ή να δημοσιοποιήσουν μια δραστηριότητα, ένα προϊόν ή μία υπηρεσία.
broader: Εικόνα (μη κινούμενη)
preferred label: Poster @en
type: Concept

Ημερίδα
broader: Εκδήλωση
preferred label: Meeting @en
type: Concept